{"text_format":"1","workbook":"xlsx","n_sheets":12,"sheets":["Normtabelle","Einstellungen","Changelog","AK6-7","AK8-9","AK10","AK11","AK12","AK13","AK14","AK15","Vorlage"],"not_rendered":{"charts":0,"images":0,"macros":1,"external_links":0,"defined_names":49,"comments":0,"pivot_tables":0},"unopened":[],"bounds":{"document_bytes":16777216,"sheet_cells":100000,"rows_first":2000,"rows_last":500,"rows_between":2000,"halvings":0,"cell_chars":16384,"cell_head_chars":4096},"cells_cut":0,"cells_raw":0,"read":"whole","date_system":"1900"}

{"sheet":"Normtabelle","index":0,"n_rows":56,"n_cols":31,"rows_kept":56,"cut":false,"hidden":false,"merged":[[10,0,10,1],[0,0,0,4],[0,5,0,24],[0,25,0,27],[0,28,0,30],[2,0,2,1],[3,0,3,1],[1,0,1,1],[5,0,5,1],[6,0,6,1],[7,0,7,1],[8,0,8,1],[9,0,9,1],[22,0,22,1],[11,0,11,1],[12,0,12,1],[13,0,13,1],[14,0,14,1],[15,0,15,1],[16,0,16,1],[17,0,17,1],[18,0,18,1],[19,0,19,1],[20,0,20,1],[21,0,21,1],[34,0,34,1],[23,0,23,1],[24,0,24,1],[25,0,25,1],[26,0,26,1],[27,0,27,1],[28,0,28,1],[29,0,29,1],[30,0,30,1],[31,0,31,1],[32,0,32,1],[33,0,33,1],[46,0,46,1],[35,0,35,1],[36,0,36,1],[37,0,37,1],[38,0,38,1],[39,0,39,1],[40,0,40,1],[41,0,41,1],[42,0,42,1],[43,0,43,1],[44,0,44,1],[45,0,45,1],[53,0,53,1],[54,0,54,1],[55,0,55,1],[47,0,47,1],[48,0,48,1],[49,0,49,1],[50,0,50,1],[51,0,51,1],[52,0,52,1]]}
["BIATHLON",null,null,null,null,"Normtabelle - Athletik",null,null,null,null,null,null,null,null,null,null,null,null,null,null,null,null,null,null,null,"akt. Stand:",null,null,"2021-07-20"]
["Feldname",null,"seil_1","seil_2","seil_3","roll_1","roll_2","roll_3","klimm","30m","einbein","hind","10sprung","schlaengel","9sprung","turn","slakline_1","slakline_2","japan","kabu","kletter","rumpf","weit","ball","400m","turn","ring_1","ring_2","ring_3","klapp","wk"]
["Übung",null,"Seilspringen","Seilspringen","Seilspringen","Rollbrett","Rollbrett","Rollbrett","Klimmzüge","30m","Einbeinstehen","Hindernislauf","10- Sprungschritte","Schlängell. mit Ballzielw.","9-er-Sprung","Turnbank- Fuß (Balken)","Slakline- 5 m","Slakeline. 10 m","Japantest","Kabu-Lauf","Kletterstange","Rumpftiefbeugen","Weitsprung","Ballwurf","400 m","Turnen","GL- Schießen (RS)   ","GL- Schießen (RS)   ","GL- Schießen (RS)   ","GL- Schießen (BS)   ","Lauf- und Komplex- WK"]
[" Bemerkungen",null," Anzahl:   1x 60 sec."," Anzahl:   2x 60 sec."," Anzahl:   3x 60 sec."," Anzahl:   1x 60 sec. / 8. Spro."," Anzahl:   2x 60 sec. / 9. Spro."," Anzahl:   3x 60 sec. / 9. Spro."," Anzahl:  max."," 2 Vers.:  in sec. / aus d. Stand"," in Minuten"," 2 Versuche:  in sec."," in cm  zur KH","2 Versuche in sek","in Meter"," 2 Versuche:  in sec."," 2 Versuche:  in m","3 Versuche: in cm"," 2 Versuche:  in sec.","2 Versuche in sec"," 1 Versuch:  in sec."," 2 Versuche:  in cm"," 3 Versuche:  in m"," 3 Versuche:  in m"," 1 Versuche:  in sec."," nach Bewertungspunkten"," 10x 1.- / 2x 5- Schuss: lg."," S12/13: 20 lg. "," S14/15: 10 lg/10st",null," in % zur Sieglg. bei allen WK"]
[" Punkte","AK","allg.Kl. - S11","S12 - S13","S14 - S15","allg.Kl. - S11","S12 - S13","S14 - S15","S10 -S15","allg. Kl. - S15","allg. Kl. - S15","allg. Kl. - S11","S12 -S15","allg Klasse","allg. Kl. - S11","allg. Klasse","S10 - S 13","S14-15","allg. Kl. - S15","allg.Kl. - S 15","allg. Kl. - S15","allg. Kl. - S15","allg. Kl. - S15","allg. Kl. - S15","allg. Kl. - S15","allg. Kl. - S 15","S10 -S11","S12 - S13","S 14/15","S12 - S15","  bis S 15"]
[0,null,0,0,0,0,0,0,0,999,0,999,0,999,0,999,0,0,999,999,999,0,0,0,999,0,0,0,0,999,100]
[1,null,43,86,129,10,20,30,null,null,8.3333333333333332E-3,46.6,2,35.6,8.1999999999999993,21.7,0.1,2.2000000000000002,10.45,17.8,12,1,1.1000000000000001,6,107,1,132,132,131,null,31]
[2,null,46,92,138,null,null,null,1,6.1,1.0416666666666666E-2,46.2,4,35.200000000000003,8.4,21.4,0.2,2.4,10.4,17.600000000000001,11.8,null,1.2,7,106,null,134,134,132,8,30]
[3,null,49,98,147,11,22,33,null,null,1.2499999999999999E-2,45.8,6,34.799999999999997,8.6,21.1,0.3,2.6,10.35,17.399999999999999,11.6,null,1.3,8,105,2,136,136,133,null,29]
[4,null,52,104,156,null,null,null,2,6,1.4583333333333332E-2,45.4,8,34.4,8.8000000000000007,20.8,0.4,2.8,10.3,17.2,11.4,2,1.4,9,104,null,138,138,134,null,28]
[5,null,55,110,165,12,24,36,null,null,1.6666666666666666E-2,45,10,34,9,20.5,0.5,3,10.25,17,11.2,null,1.5,10,103,null,140,140,135,null,27]
[6,null,58,116,174,null,null,null,3,5.9,1.8749999999999999E-2,44.6,12,33.6,9.1999999999999993,20.2,0.6,3.2,10.199999999999999,16.8,11,null,1.6,11,102,3,142,142,136,null,26]
[7,null,61,122,183,13,26,39,null,null,2.0833333333333332E-2,44.2,14,33.200000000000003,9.4,19.899999999999999,0.7,3.4,10.15,16.600000000000001,10.8,3,1.7,12,101,null,144,144,137,null,25]
[8,null,64,128,192,null,null,null,4,5.8,2.2916666666666669E-2,43.8,16,32.799999999999997,9.6,19.600000000000001,0.8,3.6,10.1,16.399999999999999,10.6,null,1.8,13,100,null,146,146,138,7,24]
[9,null,67,134,201,14,28,42,null,null,2.4999999999999998E-2,43.4,18,32.4,9.8000000000000007,19.3,0.9,3.8,10.050000000000001,16.2,10.4,null,1.9,14,99,4,148,148,139,null,23]
[10,null,70,140,210,null,null,null,5,5.7,2.7083333333333334E-2,43,20,32,10,19,1,4,10,16,10.199999999999999,4,2,15,98,null,150,150,140,null,22]
[11,null,73,146,219,15,30,45,null,null,2.9166666666666664E-2,42.6,22,31.6,10.199999999999999,18.7,1.1000000000000001,4.2,9.9499999999999993,15.8,10,null,2.1,16,97,null,152,152,141,null,21]
[12,null,76,152,228,null,null,null,6,5.6,3.125E-2,42.2,24,31.2,10.4,18.399999999999999,1.2,4.4000000000000004,9.9,15.6,9.8000000000000007,null,2.2000000000000002,17,96,5,154,154,142,null,20]
[13,null,79,158,237,null,null,null,null,null,3.3333333333333333E-2,41.8,26,30.8,10.6,18.100000000000001,1.3,4.5999999999999996,9.85,15.4,9.6,5,2.2999999999999998,18,95,null,156,156,143,"                    ",19]
[14,null,82,164,246,16,32,48,7,5.5,3.5416666666666666E-2,41.4,28,30.4,10.8,17.8,1.4,4.8,9.8000000000000007,15.2,9.4,null,2.4,19,94,null,158,158,144,6,18]
[15,null,85,170,255,null,null,null,null,null,3.7499999999999999E-2,41,30,30,11,17.5,1.5,5,9.75,15,9.1999999999999993,null,2.5,20,93,6,160,160,145,null,17]
[16,null,88,176,264,null,null,null,8,5.4,3.9583333333333331E-2,40.6,32,29.6,11.2,17.2,1.6,5.2,9.6999999999999993,14.9,9,6,2.6,21,92,null,161,161,146,null,16]
[17,null,91,182,273,17,34,51,null,null,4.1666666666666664E-2,40.200000000000003,34,29.2,11.4,16.899999999999999,1.7,5.4,9.65,14.8,8.8000000000000007,null,2.7,22,91,null,162,162,147,null,15]
[18,null,94,188,282,null,null,null,9,5.3,4.3750000000000004E-2,39.799999999999997,36,28.8,11.6,16.600000000000001,1.8,5.6,9.6,14.7,8.6,null,2.8,23,90,7,163,163,148,null,14]
[19,null,97,194,285,null,null,null,null,null,4.5833333333333337E-2,39.4,38,28.4,11.8,16.3,1.9,5.8,9.5500000000000007,14.6,8.4,7,2.9,24,89,null,164,164,149,null,13]
[20,null,100,200,300,18,36,54,10,5.2,4.7916666666666663E-2,39,40,28,12,16,2,6,9.5,14.5,8.1999999999999993,null,3,25,88,null,165,165,150,5]
[21,null,103,206,309,null,null,null,null,null,4.9999999999999996E-2,38.6,42,27.6,12.2,15.7,2.1,6.2,9.4499999999999993,14.4,8,null,3.1,26,87,8,166,166,151]
[22,null,106,212,318,null,null,null,null,5.0999999999999996,5.2083333333333336E-2,38.200000000000003,44,27.2,12.4,15.4,2.2000000000000002,6.4,9.4,14.3,7.8,8,3.2,27,86,null,167,167,152,null,12]
[23,null,109,218,327,19,38,57,11,null,5.4166666666666669E-2,37.799999999999997,46,26.8,12.6,15.1,2.2999999999999998,6.6,9.35,14.2,7.6,null,3.3,28,85,null,168,168,153]
[24,null,112,224,336,null,null,null,null,5,5.6250000000000001E-2,37.4,48,26.4,12.8,14.8,2.4,6.8,9.3000000000000007,14.1,7.4,null,3.4,29,84,9,169,169,154]
[25,null,115,230,345,null,null,null,null,null,5.8333333333333327E-2,37,50,26,13,14.5,2.5,7,9.25,14,7.2,9,3.5,30,83,null,170,170,155,null,11]
[26,null,118,236,354,20,40,60,12,4.9000000000000004,6.0416666666666667E-2,36.6,52,25.6,13.2,14.2,2.6,7.2,9.1999999999999993,13.9,7,null,3.6,31,82,null,171,171,156,4]
[27,null,121,242,363,null,null,null,null,null,6.25E-2,36.200000000000003,54,25.2,13.4,13.9,2.7,7.4,9.15,13.8,6.8,null,3.7,32,81,null,172,172,157]
[28,null,124,248,372,null,null,null,null,4.8,6.458333333333334E-2,35.799999999999997,56,24.8,13.6,13.6,2.8,7.6,9.1,13.7,6.6,10,3.8,33,80,10,173,173,158,null,10]
[29,null,127,254,381,21,42,63,13,null,6.5972222222222224E-2,35.4,58,24.4,13.8,13.3,2.9,7.8,9.0500000000000007,13.6,6.4,null,3.9,34,79,null,174,174,159]
[30,null,130,260,390,null,null,null,null,4.7,6.7361111111111108E-2,35,60,24,14,13,3,8,9,13.5,6.2,null,4,35,78,null,175,175,160,null,9]
[31,null,133,266,399,null,null,null,null,null,6.8749999999999992E-2,34.6,62,23.6,14.2,12.7,3.1,8.1,8.9499999999999993,13.4,6,11,4.0999999999999996,36,77,null,176,176,161]
[32,null,136,272,408,22,44,66,14,4.5999999999999996,7.013888888888889E-2,34.200000000000003,64,23.2,14.4,12.4,3.2,8.1999999999999993,8.9,13.3,5.8,null,4.2,37,76,11,177,177,162,3,8]
[33,null,139,278,417,null,null,null,null,null,7.1527777777777787E-2,33.799999999999997,66,22.8,14.6,12.1,3.3,8.3000000000000007,8.85,13.2,5.6,null,4.3,38,75,null,178,178,163]
[34,null,142,283,425,null,null,68,null,4.5,7.2222222222222229E-2,33.4,68,22.4,14.8,11.8,3.4,8.4,8.8000000000000007,13.1,5.4,12,4.4000000000000004,39,74,null,179,179,164]
[35,null,145,288,433,23,46,null,15,null,7.2916666666666671E-2,33,70,22,15,11.5,3.5,8.5,8.75,13,5.2,null,4.5,40,73,null,180,180,165,null,7]
[36,null,148,293,441,null,null,70,null,4.4000000000000004,7.3611111111111113E-2,32.6,72,21.6,15.2,11.2,3.6,8.6,8.6999999999999993,12.9,5,null,4.5999999999999996,41,72,12,181,181,166]
[37,null,151,298,449,null,null,null,null,null,7.4305555555555555E-2,32.200000000000003,74,21.2,15.4,10.9,3.7,8.6999999999999993,8.65,12.8,4.9000000000000004,13,4.7,42,71,null,182,182,167]
[38,null,154,303,457,24,48,72,16,4.3,7.4999999999999997E-2,31.8,76,20.8,15.6,10.6,3.8,8.8000000000000007,8.6,12.7,4.8,null,4.8,43,70,null,183,183,168,2,6]
[39,null,157,308,465,null,null,null,null,null,7.5694444444444439E-2,31.4,78,20.399999999999999,15.8,10.3,3.9,8.9,8.5500000000000007,12.6,4.7,null,4.9000000000000004,44,69,null,184,184,169]
[40,null,160,313,473,null,null,74,null,4.25,7.6388888888888895E-2,31,80,20,16,10,4,9,8.5,12.5,4.5999999999999996,14,5,45,68,13,185,185,170]
[41,null,163,318,481,25,50,null,17,null,7.7083333333333337E-2,30.6,81,19.600000000000001,16.2,9.6999999999999993,4.0999999999999996,9.1,8.4499999999999993,12.4,4.5,null,5.0999999999999996,46,67,null,186,186,171,null,5]
[42,null,166,323,489,null,null,76,null,4.2,7.7777777777777779E-2,30.2,82,19.2,16.399999999999999,9.4,4.2,9.1999999999999993,8.4,12.3,4.4000000000000004,null,5.2,47,66,null,187,187,172]
[43,null,169,328,497,null,null,null,null,null,7.8472222222222221E-2,29.8,83,18.8,16.600000000000001,9.1,4.3,9.3000000000000007,8.35,12.2,4.3,15,5.3,48,65,null,188,188,173,null,4]
[44,null,172,333,504,26,52,78,18,4.1500000000000004,7.9166666666666663E-2,29.4,84,18.399999999999999,16.8,8.8000000000000007,4.4000000000000004,9.4,8.3000000000000007,12.1,4.2,null,5.4,49,64,null,189,189,174,1]
[45,null,174,338,511,null,null,null,null,null,7.9861111111111105E-2,29,85,18,17,8.5,4.5,9.5,8.25,12,4.0999999999999996,null,5.5,50,63,14,190,190,175,null,3]
[46,null,176,343,518,null,null,80,null,4.0999999999999996,8.0555555555555561E-2,28.6,86,17.600000000000001,17.2,8.1999999999999993,4.5999999999999996,9.6,8.1999999999999993,11.9,4,16,5.6,51,62,null,191,191,176]
[47,null,178,348,525,27,54,null,19,null,8.1250000000000003E-2,28.2,87,17.2,17.399999999999999,7.9,4.7,9.6999999999999993,8.15,11.8,3.9,null,5.7,52,61,null,192,192,177]
[48,null,180,353,532,null,null,82,null,4.05,8.1944444444444445E-2,27.8,88,16.8,17.600000000000001,7.6,4.8,9.8000000000000007,8.1,11.7,3.8,null,5.8,53,60,null,193,193,178,null,2]
[49,null,182,358,539,null,null,null,null,null,8.2638888888888887E-2,27.4,89,16.399999999999999,17.8,7.3,4.9000000000000004,9.9,8.0500000000000007,11.6,3.7,null,5.9,54,59,null,194,194,179,null,1]
[50,null,184,363,546,28,56,84,20,4,8.3333333333333329E-2,27,90,16,18,7,5,10,8,11.5,3.6,17,6,55,58,15,195,195,180,0,0]

{"sheet":"Einstellungen","index":1,"n_rows":25,"n_cols":38,"rows_kept":25,"cut":false,"hidden":false,"merged":[[1,1,1,7],[1,8,1,23],[1,25,1,44],[2,1,2,7],[2,8,2,9],[2,10,2,11],[2,12,2,13],[2,14,2,15],[2,16,2,17],[2,18,2,19],[2,20,2,21],[2,22,2,23],[3,1,3,7],[3,8,3,9],[3,10,3,11],[3,12,3,13],[3,14,3,15],[3,16,3,17],[3,18,3,19],[3,20,3,21],[3,22,3,23],[4,1,4,7],[4,8,4,9],[4,10,4,11],[4,12,4,13],[4,14,4,15],[4,16,4,17],[4,18,4,19],[4,20,4,21],[4,22,4,23],[5,18,5,19],[5,20,5,21],[5,22,5,23],[6,1,6,7],[6,8,6,9],[6,10,6,11],[6,12,6,13],[6,14,6,15],[6,16,6,17],[6,18,6,19],[5,1,5,7],[5,8,5,9],[5,10,5,11],[5,12,5,13],[5,14,5,15],[5,16,5,17],[6,20,6,21],[6,22,6,23],[7,1,7,7],[7,8,7,9],[7,10,7,11],[7,12,7,13],[7,14,7,15],[7,16,7,17],[7,18,7,19],[7,20,7,21],[7,22,7,23],[8,1,8,7],[8,8,8,9],[8,10,8,11],[8,12,8,13],[8,14,8,15],[8,16,8,17],[8,18,8,19],[8,20,8,21],[8,22,8,23],[9,18,9,19],[9,20,9,21],[9,22,9,23],[10,1,10,7],[10,8,10,9],[10,10,10,11],[10,12,10,13],[10,14,10,15],[10,16,10,17],[10,18,10,19],[9,1,9,7],[9,8,9,9],[9,10,9,11],[9,12,9,13],[9,14,9,15],[9,16,9,17],[10,20,10,21],[10,22,10,23],[11,1,11,7],[11,8,11,9],[11,10,11,11],[11,12,11,13],[11,14,11,15],[11,16,11,17],[11,18,11,19],[11,20,11,21],[11,22,11,23],[12,1,12,7],[12,8,12,9],[12,10,12,11],[12,12,12,13],[12,14,12,15],[12,16,12,17],[12,18,12,19],[12,20,12,21],[12,22,12,23],[13,1,13,7],[13,8,13,9],[13,10,13,11],[13,12,13,13],[13,14,13,15],[13,16,13,17],[13,18,13,19],[13,20,13,21],[13,22,13,23],[14,1,14,7],[14,8,14,9],[14,10,14,11],[14,12,14,13],[14,14,14,15],[14,16,14,17],[14,18,14,19],[14,20,14,21],[14,22,14,23],[15,1,15,7],[15,8,15,9],[15,10,15,11],[15,12,15,13],[15,14,15,15],[15,16,15,17],[15,18,15,19],[15,20,15,21],[15,22,15,23],[16,18,16,19],[16,20,16,21],[16,22,16,23],[17,1,17,7],[17,8,17,9],[17,10,17,11],[17,12,17,13],[17,14,17,15],[17,16,17,17],[17,18,17,19],[16,1,16,7],[16,8,16,9],[16,10,16,11],[16,12,16,13],[16,14,16,15],[16,16,16,17],[17,20,17,21],[17,22,17,23],[18,1,18,7],[18,8,18,9],[18,10,18,11],[18,12,18,13],[18,14,18,15],[18,16,18,17],[18,18,18,19],[18,20,18,21],[18,22,18,23],[19,1,19,7],[19,8,19,9],[19,10,19,11],[19,12,19,13],[19,14,19,15],[19,16,19,17],[19,18,19,19],[19,20,19,21],[19,22,19,23],[20,18,20,19],[20,20,20,21],[20,22,20,23],[21,1,21,7],[21,8,21,9],[21,10,21,11],[21,12,21,13],[21,14,21,15],[21,16,21,17],[21,18,21,19],[20,1,20,7],[20,8,20,9],[20,10,20,11],[20,12,20,13],[20,14,20,15],[20,16,20,17],[21,20,21,21],[21,22,21,23],[22,1,22,7],[22,8,22,9],[22,10,22,11],[22,12,22,13],[22,14,22,15],[22,16,22,17],[22,18,22,19],[22,20,22,21],[22,22,22,23],[23,1,23,7],[23,8,23,9],[23,10,23,11],[23,12,23,13],[23,14,23,15],[23,16,23,17],[23,18,23,19],[23,20,23,21],[23,22,23,23],[24,18,24,19],[24,20,24,21],[24,22,24,23],[24,1,24,7],[24,8,24,9],[24,10,24,11],[24,12,24,13],[24,14,24,15],[24,16,24,17]]}
[]
[null,"Übungen",null,null,null,null,null,null,"Altersklassen -> Wertungen",null,null,null,null,null,null,null,null,null,null,null,null,null,null,null,null,"Tabellen erstellen"]
[null,null,null,null,null,null,null,null,"AK6-7",null,"AK8-9",null,"AK10",null,"AK11",null,"AK12",null,"AK13",null,"AK14",null,"AK15"]
[null,"Seilspringen",null,null,null,null,null,null,"seil_1",null,"seil_1",null,"seil_1",null,"seil_1",null,"seil_2",null,"seil_2",null,"seil_3",null,"seil_3",null,null,"Übung 1",null,null,1,null,null,null,null,null,"Übung 7",null,null,10]
[null,"Rollbrett",null,null,null,null,null,null,"roll_1",null,"roll_1",null,"roll_1",null,"roll_1",null,"roll_2",null,"roll_2",null,"roll_3",null,"roll_3"]
[null,"Klimmzüge",null,null,null,null,null,null,"klimm",null,"klimm",null,"klimm",null,"klimm",null,"klimm",null,"klimm",null,"klimm",null,"klimm"]
[null,"30m",null,null,null,null,null,null,"30m",null,"30m",null,"30m",null,"30m",null,"30m",null,"30m",null,"30m",null,"30m",null,null,"Übung 2",null,null,2,null,null,null,null,null,"Übung 8",null,null,19]
[null,"Einbein stehen",null,null,null,null,null,null,"einbein",null,"einbein",null,"einbein",null,"einbein",null,"einbein",null,"einbein",null,"einbein",null,"einbein"]
[null,"Hindernis lauf",null,null,null,null,null,null,"hind",null,"hind",null,"hind",null,"hind",null,"hind",null,"hind",null,"hind",null,"hind"]
[null,"10er-Sprung schritte",null,null,null,null,null,null,"10sprung",null,"10sprung",null,"10sprung",null,"10sprung",null,"10sprung",null,"10sprung",null,"10sprung",null,"10sprung",null,null,"Übung 3",null,null,3,null,null,null,null,null,"Übung 9",null,null,8]
[null,"9er-Sprung",null,null,null,null,null,null,"9sprung",null,"9sprung",null,"9sprung",null,"9sprung",null,"9sprung",null,"9sprung",null,"9sprung",null,"9sprung"]
[null,"Turnbank- Fuß",null,null,null,null,null,null,"balken",null,"balken",null,"balken",null,"balken",null,"balken",null,"balken",null,"balken",null,"balken"]
[null,"Slakline",null,null,null,null,null,null,null,null,null,null,"slakline_1",null,"slakline_1",null,"slakline_1",null,"slakline_1",null,"slakline_2",null,"slakline_2",null,null,"Übung 4",null,null,4,null,null,null,null,null,"Übung 10",null,null,7]
[null,"Japantest",null,null,null,null,null,null,"japan",null,"japan",null,"japan",null,"japan",null,"japan",null,"japan",null,"japan",null,"japan"]
[null,"Kletter stange",null,null,null,null,null,null,"kletter",null,"kletter",null,"kletter",null,"kletter",null,"kletter",null,"kletter",null,"kletter",null,"kletter"]
[null,"Rumpf tiefbeugen",null,null,null,null,null,null,"rumpf",null,"rumpf",null,"rumpf",null,"rumpf",null,"rumpf",null,"rumpf",null,"rumpf",null,"rumpf",null,null,"Übung 5",null,null,6,null,null,null,null,null,"Wahlübung 1"]
[null,"Weitsprung",null,null,null,null,null,null,"weit",null,"weit",null,"weit",null,"weit",null,"weit",null,"weit",null,"weit",null,"weit"]
[null,"Ballwurf",null,null,null,null,null,null,"ball",null,"ball",null,"ball",null,"ball",null,"ball",null,"ball",null,"ball",null,"ball"]
[null,"400 m",null,null,null,null,null,null,"400m",null,"400m",null,"400m",null,"400m",null,"400m",null,"400m",null,"400m",null,"400m",null,null,"Übung 6",null,null,17,null,null,null,null,null,"Wahlübung 2"]
[null,"Kabulauf",null,null,null,null,null,null,"kabu",null,"kabu",null,"kabu",null,"kabu",null,"kabu",null,"kabu",null,"kabu",null,"kabu"]
[null,"Schlängel lauf",null,null,null,null,null,null,"schlaengel",null,"schlaengel",null,"schlaengel",null,"schlaengel",null,"schlaengel",null,"schlaengel",null,"schlaengel",null,"schlaengel"]
[null,"Turnen",null,null,null,null,null,null,"turn",null,"turn",null,"turn",null,"turn",null,"turn",null,"turn",null,"turn",null,"turn"]
[null,"Ring",null,null,null,null,null,null,null,null,null,null,"ring_1",null,"ring_1",null,"ring_2",null,"ring_2",null,"ring_3",null,"ring_3"]
[null,"Klapp",null,null,null,null,null,null,null,null,null,null,null,null,null,null,"klapp",null,"klapp",null,"klapp",null,"klapp"]
[null,"Komplex-WK",null,null,null,null,null,null,"wk",null,"wk",null,"wk",null,"wk",null,"wk",null,"wk",null,"wk",null,"wk"]

{"sheet":"Changelog","index":2,"n_rows":16,"n_cols":3,"rows_kept":16,"cut":false,"hidden":false,"merged":[]}
[]
["Date","Version","Changes"]
["2021-09-08","2.30","fixed bug in default exercise fields\nadded Slakline 10m exercise"]
["2020-08-20","2.20","split \"Normtabelle\" and config sheet\nuse new excel source of \"Normtabelle\" with slight modifications\nchanged vslookup functions to index/match approach\nremoved 10m slakline exercise"]
["2019-09-19","2.14","updated points table to November 2018 state\n"]
["2019-09-11","2.13","added support of 'n.a.' as allowed value\nadded summary sheet feature\nremoved restriction of some macros not being able to be executed on blueprint sheet"]
["2019-09-09","2.12","fixed bug with points of 'Ringserie'\nfixed bug with points of 'BS Klapp'\nfixed bug with points of 'Komplexwettkampf'\nchanged value of 'Einbeinstehen' to seconds"]
["2018-09-18","2.11","fixed bug with combo box linked cell\nfixed bug with exercise title cell\nuse smaller font for name and club cells\nfixed bug in ranking column"]
["2018-08-04","2.10","updated scoring table to 2018\nadded new exercise 'Slakline 10m'\nprotect blueprint sheet and unprotect during copy process\nfixed bug in sum function\n"]
["2017-08-28","2.03","adapted points table to current year:\n  Seilspringen"]
["2016-12-20","2.02","cleanup\nminor changes in sorting macro"]
["2016-09-17","2.01","fixed issue with sorting macros"]
["2016-09-16","2.0","complete overhaul of the workbook:\n  sheets are created via macro\n  formulas are inserted via macro\n  decoupled view and logic\n  changed ranges naming convention\n  created table to map age classes and scoring charts\n  made exercises 1 to 12 configurable"]
["2016-09-14","1.52","extended lists to 23 slots\nimproved sorting macro"]
["2016-09-02","1.51","fixed readonly access for the new reference cells of the control elements \nchanged exercise '10er SprungSchritte' to 'Turnbank' for AK6-7 and AK8-9"]
["2016-08-15","1.5","added exercise 'Kabulauf' \nadded exercise 'Schlängellauf' \nchanged optional exercises for current year(2016)\nchanged scoring charts for Rumpftiefbeugen, 9er Sprung, Turnen\nchanged placement of optional exercise selection control elements\n"]

{"sheet":"AK6-7","index":3,"n_rows":83,"n_cols":35,"rows_kept":83,"cut":false,"hidden":false,"merged":[[7,30,8,31],[7,32,8,33],[7,34,8,34],[7,18,8,19],[7,20,8,21],[7,22,8,23],[7,24,8,25],[7,26,8,27],[7,28,8,29],[6,28,6,29],[6,30,6,31],[6,32,6,33],[7,4,8,5],[7,6,8,7],[7,8,8,9],[7,10,8,11],[7,12,8,13],[7,14,8,15],[7,16,8,17],[6,16,6,17],[6,18,6,19],[6,20,6,21],[6,22,6,23],[6,24,6,25],[6,26,6,27],[6,14,6,15],[6,4,6,5],[6,6,6,7],[6,8,6,9],[6,10,6,11],[6,12,6,13]]}
["Altersklasse:",null,null,{"$f":"MID(CELL(\"Dateiname\",$A$1),FIND(\"]\",CELL(\"Dateiname\",$A$1))+1,31)","v":"AK6-7"}]
[]
["Siegzeit Wettkampf m:",null,null,"00:04:44.400"]
[]
["Siegzeit Wettkampf w:",null,null,"00:05:53.200"]
[]
[null,null,null,null,"Übung 1",null,"Übung 2",null,"Übung 3",null,"Übung 4",null,"Übung 5",null,"Übung 6",null,"Übung 7",null,"Übung 8",null,"Übung 9",null,"Übung 10",null,"Wahl 1",null,"Wahl 2"]
[null,null,null,null,{"$f":"IF(ISBLANK($C$61),\"\",INDEX(exercisesSelect,$C$61,1))","v":"Seilspringen"},null,{"$f":"IF(ISBLANK($C$63),\"\",INDEX(exercisesSelect,$C$63,1))","v":"Rollbrett"},null,{"$f":"IF(ISBLANK($C$65),\"\",INDEX(exercisesSelect,$C$65,1))","v":"Klimmzüge"},null,{"$f":"IF(ISBLANK($C$67),\"\",INDEX(exercisesSelect,$C$67,1))","v":"30m"},null,{"$f":"IF(ISBLANK($C$69),\"\",INDEX(exercisesSelect,$C$69,1))","v":"Hindernis lauf"},null,{"$f":"IF(ISBLANK($C$71),\"\",INDEX(exercisesSelect,$C$71,1))","v":"Kabulauf"},null,{"$f":"IF(ISBLANK($C$73),\"\",INDEX(exercisesSelect,$C$73,1))","v":"Turnbank- Fuß"},null,{"$f":"IF(ISBLANK($C$75),\"\",INDEX(exercisesSelect,$C$75,1))","v":"Turnen"},null,{"$f":"IF(ISBLANK($C$77),\"\",INDEX(exercisesSelect,$C$77,1))","v":"Schlängel lauf"},null,{"$f":"IF(ISBLANK($C$79),\"\",INDEX(exercisesSelect,$C$79,1))","v":"9er-Sprung"},null,{"$f":"IF(ISBLANK($C$81),\"\",INDEX(exercisesSelect,$C$81,1))","v":""},null,{"$f":"IF(ISBLANK($C$83),\"\",INDEX(exercisesSelect,$C$83,1))","v":""},null,"Ring\nschießen",null,"BS / Klapp",null,"Komplex - WK",null,"Punkte"]
[]
["Platz","St-Nr.","Name, Vorname","Verein",null,"Pkt",null,"Pkt",null,"Pkt",null,"Pkt",null,"Pkt",null,"Pkt",null,"Pkt",null,"Pkt",null,"Pkt",null,"Pkt",null,"Pkt",null,"Pkt",null,"Pkt",null,"Pkt",null,"Pkt"]
[{"$f":"IF(ISBLANK(B11),\"\",RANK(AI11,$AI$11:$AI$33))","v":1},60,"REIPRICH, Wim","SG Blau-Weiß Zwenkau",24,{"$f":"IF(E11=\"n.a.\",0,IF(ISBLANK(E11),\"\",INDEX(exe_punkte,MATCH(E11,exe_seil_1,1))))","v":0},null,{"$f":"IF(G11=\"n.a.\",0,IF(ISBLANK(G11),\"\",INDEX(exe_punkte,MATCH(G11,exe_roll_1,1))))","v":""},null,{"$f":"IF(I11=\"n.a.\",0,IF(ISBLANK(I11),\"\",INDEX(exe_punkte,MATCH(I11,exe_klimm,1))))","v":""},6.87,{"$f":"IF(K11=\"n.a.\",0,IF(ISBLANK(K11),\"\",INDEX(exe_punkte,MATCH(K11,exe_30m,-1))))","v":0},60.5,{"$f":"IF(M11=\"n.a.\",0,IF(ISBLANK(M11),\"\",INDEX(exe_punkte,MATCH(M11,exe_hind,-1))))","v":0},25.9,{"$f":"IF(O11=\"n.a.\",0,IF(ISBLANK(O11),\"\",INDEX(exe_punkte,MATCH(O11,exe_kabu,-1))))","v":0},11.97,{"$f":"IF(Q11=\"n.a.\",0,IF(ISBLANK(Q11),\"\",INDEX(exe_punkte,MATCH(Q11,exe_balken,-1))))","v":33},6,{"$f":"IF(S11=\"n.a.\",0,IF(ISBLANK(S11),\"\",INDEX(exe_punkte,MATCH(S11,exe_turn,1))))","v":15},33.1,{"$f":"IF(U11=\"n.a.\",0,IF(ISBLANK(U11),\"\",INDEX(exe_punkte,MATCH(U11,exe_schlaengel,-1))))","v":7},9.9,{"$f":"IF(W11=\"n.a.\",0,IF(ISBLANK(W11),\"\",INDEX(exe_punkte,MATCH(W11,exe_9sprung,1))))","v":9},null,null,null,null,null,null,null,null,"00:04:44.400",{"$f":"IF(AG11=\"n.a.\",0,IF(ISBLANK(AG11),\"\",INDEX(exe_punkte,MATCH(((AG11-$D$3)/$D$3)*100,exe_wk,-1))*2))","v":100},{"$f":"IFERROR(IF(ROW(B11)=ROW(F11),IF(ISBLANK(B11),\"\",SUM(F11,H11,J11,L11,N11,P11,R11,T11,V11,X11,Z11,AB11,AD11,AF11,AH11)),\"Fehler! Ausschneiden nicht erlaubt\"),\"Fehler! Ausschneiden nicht erlaubt\")","v":164}]
[{"$f":"IF(ISBLANK(B12),\"\",RANK(AI12,$AI$11:$AI$33))","v":2},61,"KITZMANN, Arthur","Skiclub 1927 Köthen",10,{"$f":"IF(E12=\"n.a.\",0,IF(ISBLANK(E12),\"\",INDEX(exe_punkte,MATCH(E12,exe_seil_1,1))))","v":0},null,{"$f":"IF(G12=\"n.a.\",0,IF(ISBLANK(G12),\"\",INDEX(exe_punkte,MATCH(G12,exe_roll_1,1))))","v":""},null,{"$f":"IF(I12=\"n.a.\",0,IF(ISBLANK(I12),\"\",INDEX(exe_punkte,MATCH(I12,exe_klimm,1))))","v":""},6.56,{"$f":"IF(K12=\"n.a.\",0,IF(ISBLANK(K12),\"\",INDEX(exe_punkte,MATCH(K12,exe_30m,-1))))","v":0},61.1,{"$f":"IF(M12=\"n.a.\",0,IF(ISBLANK(M12),\"\",INDEX(exe_punkte,MATCH(M12,exe_hind,-1))))","v":0},21.65,{"$f":"IF(O12=\"n.a.\",0,IF(ISBLANK(O12),\"\",INDEX(exe_punkte,MATCH(O12,exe_kabu,-1))))","v":0},13.22,{"$f":"IF(Q12=\"n.a.\",0,IF(ISBLANK(Q12),\"\",INDEX(exe_punkte,MATCH(Q12,exe_balken,-1))))","v":29},10,{"$f":"IF(S12=\"n.a.\",0,IF(ISBLANK(S12),\"\",INDEX(exe_punkte,MATCH(S12,exe_turn,1))))","v":28},27.8,{"$f":"IF(U12=\"n.a.\",0,IF(ISBLANK(U12),\"\",INDEX(exe_punkte,MATCH(U12,exe_schlaengel,-1))))","v":20},10,{"$f":"IF(W12=\"n.a.\",0,IF(ISBLANK(W12),\"\",INDEX(exe_punkte,MATCH(W12,exe_9sprung,1))))","v":10},null,null,null,null,null,null,null,null,"00:05:15",{"$f":"IF(AG12=\"n.a.\",0,IF(ISBLANK(AG12),\"\",INDEX(exe_punkte,MATCH(((AG12-$D$3)/$D$3)*100,exe_wk,-1))*2))","v":50},{"$f":"IFERROR(IF(ROW(B12)=ROW(F12),IF(ISBLANK(B12),\"\",SUM(F12,H12,J12,L12,N12,P12,R12,T12,V12,X12,Z12,AB12,AD12,AF12,AH12)),\"Fehler! Ausschneiden nicht erlaubt\"),\"Fehler! Ausschneiden nicht erlaubt\")","v":137}]
[3,31,"DAMASCHKE, Onno","SG Klotzsche",null,{"$f":"IF(E13=\"n.a.\",0,IF(ISBLANK(E13),\"\",INDEX(exe_punkte,MATCH(E13,exe_seil_1,1))))","v":""},null,{"$f":"IF(G13=\"n.a.\",0,IF(ISBLANK(G13),\"\",INDEX(exe_punkte,MATCH(G13,exe_roll_1,1))))","v":""},null,{"$f":"IF(I13=\"n.a.\",0,IF(ISBLANK(I13),\"\",INDEX(exe_punkte,MATCH(I13,exe_klimm,1))))","v":""},null,{"$f":"IF(K13=\"n.a.\",0,IF(ISBLANK(K13),\"\",INDEX(exe_punkte,MATCH(K13,exe_30m,-1))))","v":""},null,{"$f":"IF(M13=\"n.a.\",0,IF(ISBLANK(M13),\"\",INDEX(exe_punkte,MATCH(M13,exe_hind,-1))))","v":""},null,{"$f":"IF(O13=\"n.a.\",0,IF(ISBLANK(O13),\"\",INDEX(exe_punkte,MATCH(O13,exe_kabu,-1))))","v":""},null,{"$f":"IF(Q13=\"n.a.\",0,IF(ISBLANK(Q13),\"\",INDEX(exe_punkte,MATCH(Q13,exe_balken,-1))))","v":""},null,{"$f":"IF(S13=\"n.a.\",0,IF(ISBLANK(S13),\"\",INDEX(exe_punkte,MATCH(S13,exe_turn,1))))","v":""},null,{"$f":"IF(U13=\"n.a.\",0,IF(ISBLANK(U13),\"\",INDEX(exe_punkte,MATCH(U13,exe_schlaengel,-1))))","v":""},null,{"$f":"IF(W13=\"n.a.\",0,IF(ISBLANK(W13),\"\",INDEX(exe_punkte,MATCH(W13,exe_9sprung,1))))","v":""},null,null,null,null,null,null,null,null,"00:05:21",{"$f":"IF(AG13=\"n.a.\",0,IF(ISBLANK(AG13),\"\",INDEX(exe_punkte,MATCH(((AG13-$D$3)/$D$3)*100,exe_wk,-1))*2))","v":38},{"$f":"IFERROR(IF(ROW(B13)=ROW(F13),IF(ISBLANK(B13),\"\",SUM(F13,H13,J13,L13,N13,P13,R13,T13,V13,X13,Z13,AB13,AD13,AF13,AH13)),\"Fehler! Ausschneiden nicht erlaubt\"),\"Fehler! Ausschneiden nicht erlaubt\")","v":38}]
["",null,null,null,null,{"$f":"IF(E14=\"n.a.\",0,IF(ISBLANK(E14),\"\",INDEX(exe_punkte,MATCH(E14,exe_seil_1,1))))","v":""},null,{"$f":"IF(G14=\"n.a.\",0,IF(ISBLANK(G14),\"\",INDEX(exe_punkte,MATCH(G14,exe_roll_1,1))))","v":""},null,{"$f":"IF(I14=\"n.a.\",0,IF(ISBLANK(I14),\"\",INDEX(exe_punkte,MATCH(I14,exe_klimm,1))))","v":""},null,{"$f":"IF(K14=\"n.a.\",0,IF(ISBLANK(K14),\"\",INDEX(exe_punkte,MATCH(K14,exe_30m,-1))))","v":""},null,{"$f":"IF(M14=\"n.a.\",0,IF(ISBLANK(M14),\"\",INDEX(exe_punkte,MATCH(M14,exe_hind,-1))))","v":""},null,{"$f":"IF(O14=\"n.a.\",0,IF(ISBLANK(O14),\"\",INDEX(exe_punkte,MATCH(O14,exe_kabu,-1))))","v":""},null,{"$f":"IF(Q14=\"n.a.\",0,IF(ISBLANK(Q14),\"\",INDEX(exe_punkte,MATCH(Q14,exe_balken,-1))))","v":""},null,{"$f":"IF(S14=\"n.a.\",0,IF(ISBLANK(S14),\"\",INDEX(exe_punkte,MATCH(S14,exe_turn,1))))","v":""},null,{"$f":"IF(U14=\"n.a.\",0,IF(ISBLANK(U14),\"\",INDEX(exe_punkte,MATCH(U14,exe_schlaengel,-1))))","v":""},null,{"$f":"IF(W14=\"n.a.\",0,IF(ISBLANK(W14),\"\",INDEX(exe_punkte,MATCH(W14,exe_9sprung,1))))","v":""},null,null,null,null,null,null,null,null,null,{"$f":"IF(AG14=\"n.a.\",0,IF(ISBLANK(AG14),\"\",INDEX(exe_punkte,MATCH(((AG14-$D$3)/$D$3)*100,exe_wk,-1))*2))","v":""},{"$f":"IFERROR(IF(ROW(B14)=ROW(F14),IF(ISBLANK(B14),\"\",SUM(F14,H14,J14,L14,N14,P14,R14,T14,V14,X14,Z14,AB14,AD14,AF14,AH14)),\"Fehler! Ausschneiden nicht erlaubt\"),\"Fehler! Ausschneiden nicht erlaubt\")","v":""}]
["",null,null,null,null,"",null,"",null,"",null,"",null,"",null,"",null,"",null,"",null,"",null,"",null,null,null,null,null,null,null,null,null,"",""]
["",null,null,null,null,"",null,"",null,"",null,"",null,"",null,"",null,"",null,"",null,"",null,"",null,null,null,null,null,null,null,null,null,"",""]
["",null,null,null,null,"",null,"",null,"",null,"",null,"",null,"",null,"",null,"",null,"",null,"",null,null,null,null,null,null,null,null,null,"",""]
["",null,null,null,null,"",null,"",null,"",null,"",null,"",null,"",null,"",null,"",null,"",null,"",null,null,null,null,null,null,null,null,null,"",""]
["",null,null,null,null,"",null,"",null,"",null,"",null,"",null,"",null,"",null,"",null,"",null,"",null,null,null,null,null,null,null,null,null,"",""]
["",null,null,null,null,"",null,"",null,"",null,"",null,"",null,"",null,"",null,"",null,"",null,"",null,null,null,null,null,null,null,null,null,"",""]
["",null,null,null,null,"",null,"",null,"",null,"",null,"",null,"",null,"",null,"",null,"",null,"",null,null,null,null,null,null,null,null,null,"",""]
["",null,null,null,null,"",null,"",null,"",null,"",null,"",null,"",null,"",null,"",null,"",null,"",null,null,null,null,null,null,null,null,null,"",""]
["",null,null,null,null,"",null,"",null,"",null,"",null,"",null,"",null,"",null,"",null,"",null,"",null,null,null,null,null,null,null,null,null,"",""]
["",null,null,null,null,"",null,"",null,"",null,"",null,"",null,"",null,"",null,"",null,"",null,"",null,null,null,null,null,null,null,null,null,"",""]
["",null,null,null,null,"",null,"",null,"",null,"",null,"",null,"",null,"",null,"",null,"",null,"",null,null,null,null,null,null,null,null,null,"",""]
["",null,null,null,null,"",null,"",null,"",null,"",null,"",null,"",null,"",null,"",null,"",null,"",null,null,null,null,null,null,null,null,null,"",""]
["",null,null,null,null,"",null,"",null,"",null,"",null,"",null,"",null,"",null,"",null,"",null,"",null,null,null,null,null,null,null,null,null,"",""]
["",null,null,null,null,"",null,"",null,"",null,"",null,"",null,"",null,"",null,"",null,"",null,"",null,null,null,null,null,null,null,null,null,"",""]
["",null,null,null,null,"",null,"",null,"",null,"",null,"",null,"",null,"",null,"",null,"",null,"",null,null,null,null,null,null,null,null,null,"",""]
["",null,null,null,null,"",null,"",null,"",null,"",null,"",null,"",null,"",null,"",null,"",null,"",null,null,null,null,null,null,null,null,null,"",""]
["",null,null,null,null,"",null,"",null,"",null,"",null,"",null,"",null,"",null,"",null,"",null,"",null,null,null,null,null,null,null,null,null,"",""]
["",null,null,null,null,"",null,"",null,"",null,"",null,"",null,"",null,"",null,"",null,"",null,"",null,null,null,null,null,null,null,null,null,"",""]
["",null,null,null,null,"",null,"",null,"",null,"",null,"",null,"",null,"",null,"",null,"",null,"",null,null,null,null,null,null,null,null,null,"",""]
[]
["Platz","St-Nr.","Name, Vorname","Verein",null,"Pkt",null,"Pkt",null,"Pkt",null,"Pkt",null,"Pkt",null,"Pkt",null,"Pkt",null,"Pkt",null,"Pkt",null,"Pkt",null,"Pkt",null,"Pkt",null,"Pkt",null,"Pkt",null,"Pkt"]
[{"$f":"IF(ISBLANK(B36),\"\",RANK(AI36,$AI$36:$AI$58))","v":1},62,"ULBRICH, Leonie","SG Stahl Schmiedeberg",20,{"$f":"IF(E36=\"n.a.\",0,IF(ISBLANK(E36),\"\",INDEX(exe_punkte,MATCH(E36,exe_seil_1,1))))","v":0},null,{"$f":"IF(G36=\"n.a.\",0,IF(ISBLANK(G36),\"\",INDEX(exe_punkte,MATCH(G36,exe_roll_1,1))))","v":""},null,{"$f":"IF(I36=\"n.a.\",0,IF(ISBLANK(I36),\"\",INDEX(exe_punkte,MATCH(I36,exe_klimm,1))))","v":""},6.78,{"$f":"IF(K36=\"n.a.\",0,IF(ISBLANK(K36),\"\",INDEX(exe_punkte,MATCH(K36,exe_30m,-1))))","v":0},63.9,{"$f":"IF(M36=\"n.a.\",0,IF(ISBLANK(M36),\"\",INDEX(exe_punkte,MATCH(M36,exe_hind,-1))))","v":0},20.62,{"$f":"IF(O36=\"n.a.\",0,IF(ISBLANK(O36),\"\",INDEX(exe_punkte,MATCH(O36,exe_kabu,-1))))","v":0},9.2200000000000006,{"$f":"IF(Q36=\"n.a.\",0,IF(ISBLANK(Q36),\"\",INDEX(exe_punkte,MATCH(Q36,exe_balken,-1))))","v":42},7,{"$f":"IF(S36=\"n.a.\",0,IF(ISBLANK(S36),\"\",INDEX(exe_punkte,MATCH(S36,exe_turn,1))))","v":18},31,{"$f":"IF(U36=\"n.a.\",0,IF(ISBLANK(U36),\"\",INDEX(exe_punkte,MATCH(U36,exe_schlaengel,-1))))","v":12},10.199999999999999,{"$f":"IF(W36=\"n.a.\",0,IF(ISBLANK(W36),\"\",INDEX(exe_punkte,MATCH(W36,exe_9sprung,1))))","v":11},null,null,null,null,null,null,null,null,"00:06:03.400",{"$f":"IF(AG36=\"n.a.\",0,IF(ISBLANK(AG36),\"\",INDEX(exe_punkte,MATCH(((AG36-$D$5)/$D$5)*100,exe_wk,-1))*2))","v":90},{"$f":"IFERROR(IF(ROW(B36)=ROW(F36),IF(ISBLANK(B36),\"\",SUM(F36,H36,J36,L36,N36,P36,R36,T36,V36,X36,Z36,AB36,AD36,AF36,AH36)),\"Fehler! Ausschneiden nicht erlaubt\"),\"Fehler! Ausschneiden nicht erlaubt\")","v":173}]
[{"$f":"IF(ISBLANK(B37),\"\",RANK(AI37,$AI$36:$AI$58))","v":2},63,"IMHOF, Elise","SG Stahl Schmiedeberg",16,{"$f":"IF(E37=\"n.a.\",0,IF(ISBLANK(E37),\"\",INDEX(exe_punkte,MATCH(E37,exe_seil_1,1))))","v":0},null,{"$f":"IF(G37=\"n.a.\",0,IF(ISBLANK(G37),\"\",INDEX(exe_punkte,MATCH(G37,exe_roll_1,1))))","v":""},null,{"$f":"IF(I37=\"n.a.\",0,IF(ISBLANK(I37),\"\",INDEX(exe_punkte,MATCH(I37,exe_klimm,1))))","v":""},7.43,{"$f":"IF(K37=\"n.a.\",0,IF(ISBLANK(K37),\"\",INDEX(exe_punkte,MATCH(K37,exe_30m,-1))))","v":0},58.8,{"$f":"IF(M37=\"n.a.\",0,IF(ISBLANK(M37),\"\",INDEX(exe_punkte,MATCH(M37,exe_hind,-1))))","v":0},24.37,{"$f":"IF(O37=\"n.a.\",0,IF(ISBLANK(O37),\"\",INDEX(exe_punkte,MATCH(O37,exe_kabu,-1))))","v":0},null,{"$f":"IF(Q37=\"n.a.\",0,IF(ISBLANK(Q37),\"\",INDEX(exe_punkte,MATCH(Q37,exe_balken,-1))))","v":""},6,{"$f":"IF(S37=\"n.a.\",0,IF(ISBLANK(S37),\"\",INDEX(exe_punkte,MATCH(S37,exe_turn,1))))","v":15},35.9,{"$f":"IF(U37=\"n.a.\",0,IF(ISBLANK(U37),\"\",INDEX(exe_punkte,MATCH(U37,exe_schlaengel,-1))))","v":0},7.6,{"$f":"IF(W37=\"n.a.\",0,IF(ISBLANK(W37),\"\",INDEX(exe_punkte,MATCH(W37,exe_9sprung,1))))","v":0},null,null,null,null,null,null,null,null,"00:05:53.200",{"$f":"IF(AG37=\"n.a.\",0,IF(ISBLANK(AG37),\"\",INDEX(exe_punkte,MATCH(((AG37-$D$5)/$D$5)*100,exe_wk,-1))*2))","v":100},{"$f":"IFERROR(IF(ROW(B37)=ROW(F37),IF(ISBLANK(B37),\"\",SUM(F37,H37,J37,L37,N37,P37,R37,T37,V37,X37,Z37,AB37,AD37,AF37,AH37)),\"Fehler! Ausschneiden nicht erlaubt\"),\"Fehler! Ausschneiden nicht erlaubt\")","v":115}]
[3,64,"HOHENSTEIN, Natalie","SG Stahl Schmiedeberg",19,{"$f":"IF(E38=\"n.a.\",0,IF(ISBLANK(E38),\"\",INDEX(exe_punkte,MATCH(E38,exe_seil_1,1))))","v":0},null,{"$f":"IF(G38=\"n.a.\",0,IF(ISBLANK(G38),\"\",INDEX(exe_punkte,MATCH(G38,exe_roll_1,1))))","v":""},null,{"$f":"IF(I38=\"n.a.\",0,IF(ISBLANK(I38),\"\",INDEX(exe_punkte,MATCH(I38,exe_klimm,1))))","v":""},6.35,{"$f":"IF(K38=\"n.a.\",0,IF(ISBLANK(K38),\"\",INDEX(exe_punkte,MATCH(K38,exe_30m,-1))))","v":0},74.3,{"$f":"IF(M38=\"n.a.\",0,IF(ISBLANK(M38),\"\",INDEX(exe_punkte,MATCH(M38,exe_hind,-1))))","v":0},31.7,{"$f":"IF(O38=\"n.a.\",0,IF(ISBLANK(O38),\"\",INDEX(exe_punkte,MATCH(O38,exe_kabu,-1))))","v":0},19.899999999999999,{"$f":"IF(Q38=\"n.a.\",0,IF(ISBLANK(Q38),\"\",INDEX(exe_punkte,MATCH(Q38,exe_balken,-1))))","v":7},6,{"$f":"IF(S38=\"n.a.\",0,IF(ISBLANK(S38),\"\",INDEX(exe_punkte,MATCH(S38,exe_turn,1))))","v":15},39.700000000000003,{"$f":"IF(U38=\"n.a.\",0,IF(ISBLANK(U38),\"\",INDEX(exe_punkte,MATCH(U38,exe_schlaengel,-1))))","v":0},7.4,{"$f":"IF(W38=\"n.a.\",0,IF(ISBLANK(W38),\"\",INDEX(exe_punkte,MATCH(W38,exe_9sprung,1))))","v":0},null,null,null,null,null,null,null,null,"00:06:14.700",{"$f":"IF(AG38=\"n.a.\",0,IF(ISBLANK(AG38),\"\",INDEX(exe_punkte,MATCH(((AG38-$D$5)/$D$5)*100,exe_wk,-1))*2))","v":70},{"$f":"IFERROR(IF(ROW(B38)=ROW(F38),IF(ISBLANK(B38),\"\",SUM(F38,H38,J38,L38,N38,P38,R38,T38,V38,X38,Z38,AB38,AD38,AF38,AH38)),\"Fehler! Ausschneiden nicht erlaubt\"),\"Fehler! Ausschneiden nicht erlaubt\")","v":92}]
["",null,null,null,null,{"$f":"IF(E39=\"n.a.\",0,IF(ISBLANK(E39),\"\",INDEX(exe_punkte,MATCH(E39,exe_seil_1,1))))","v":""},null,{"$f":"IF(G39=\"n.a.\",0,IF(ISBLANK(G39),\"\",INDEX(exe_punkte,MATCH(G39,exe_roll_1,1))))","v":""},null,{"$f":"IF(I39=\"n.a.\",0,IF(ISBLANK(I39),\"\",INDEX(exe_punkte,MATCH(I39,exe_klimm,1))))","v":""},null,{"$f":"IF(K39=\"n.a.\",0,IF(ISBLANK(K39),\"\",INDEX(exe_punkte,MATCH(K39,exe_30m,-1))))","v":""},null,{"$f":"IF(M39=\"n.a.\",0,IF(ISBLANK(M39),\"\",INDEX(exe_punkte,MATCH(M39,exe_hind,-1))))","v":""},null,{"$f":"IF(O39=\"n.a.\",0,IF(ISBLANK(O39),\"\",INDEX(exe_punkte,MATCH(O39,exe_kabu,-1))))","v":""},null,{"$f":"IF(Q39=\"n.a.\",0,IF(ISBLANK(Q39),\"\",INDEX(exe_punkte,MATCH(Q39,exe_balken,-1))))","v":""},null,{"$f":"IF(S39=\"n.a.\",0,IF(ISBLANK(S39),\"\",INDEX(exe_punkte,MATCH(S39,exe_turn,1))))","v":""},null,{"$f":"IF(U39=\"n.a.\",0,IF(ISBLANK(U39),\"\",INDEX(exe_punkte,MATCH(U39,exe_schlaengel,-1))))","v":""},null,{"$f":"IF(W39=\"n.a.\",0,IF(ISBLANK(W39),\"\",INDEX(exe_punkte,MATCH(W39,exe_9sprung,1))))","v":""},null,null,null,null,null,null,null,null,null,{"$f":"IF(AG39=\"n.a.\",0,IF(ISBLANK(AG39),\"\",INDEX(exe_punkte,MATCH(((AG39-$D$5)/$D$5)*100,exe_wk,-1))*2))","v":""},{"$f":"IFERROR(IF(ROW(B39)=ROW(F39),IF(ISBLANK(B39),\"\",SUM(F39,H39,J39,L39,N39,P39,R39,T39,V39,X39,Z39,AB39,AD39,AF39,AH39)),\"Fehler! Ausschneiden nicht erlaubt\"),\"Fehler! Ausschneiden nicht erlaubt\")","v":""}]
["",null,null,null,null,"",null,"",null,"",null,"",null,"",null,"",null,"",null,"",null,"",null,"",null,null,null,null,null,null,null,null,null,"",""]
["",null,null,null,null,"",null,"",null,"",null,"",null,"",null,"",null,"",null,"",null,"",null,"",null,null,null,null,null,null,null,null,null,"",""]
["",null,null,null,null,"",null,"",null,"",null,"",null,"",null,"",null,"",null,"",null,"",null,"",null,null,null,null,null,null,null,null,null,"",""]
["",null,null,null,null,"",null,"",null,"",null,"",null,"",null,"",null,"",null,"",null,"",null,"",null,null,null,null,null,null,null,null,null,"",""]
["",null,null,null,null,"",null,"",null,"",null,"",null,"",null,"",null,"",null,"",null,"",null,"",null,null,null,null,null,null,null,null,null,"",""]
["",null,null,null,null,"",null,"",null,"",null,"",null,"",null,"",null,"",null,"",null,"",null,"",null,null,null,null,null,null,null,null,null,"",""]
["",null,null,null,null,"",null,"",null,"",null,"",null,"",null,"",null,"",null,"",null,"",null,"",null,null,null,null,null,null,null,null,null,"",""]
["",null,null,null,null,"",null,"",null,"",null,"",null,"",null,"",null,"",null,"",null,"",null,"",null,null,null,null,null,null,null,null,null,"",""]
["",null,null,null,null,"",null,"",null,"",null,"",null,"",null,"",null,"",null,"",null,"",null,"",null,null,null,null,null,null,null,null,null,"",""]
["",null,null,null,null,"",null,"",null,"",null,"",null,"",null,"",null,"",null,"",null,"",null,"",null,null,null,null,null,null,null,null,null,"",""]
["",null,null,null,null,"",null,"",null,"",null,"",null,"",null,"",null,"",null,"",null,"",null,"",null,null,null,null,null,null,null,null,null,"",""]
["",null,null,null,null,"",null,"",null,"",null,"",null,"",null,"",null,"",null,"",null,"",null,"",null,null,null,null,null,null,null,null,null,"",""]
["",null,null,null,null,"",null,"",null,"",null,"",null,"",null,"",null,"",null,"",null,"",null,"",null,null,null,null,null,null,null,null,null,"",""]
["",null,null,null,null,"",null,"",null,"",null,"",null,"",null,"",null,"",null,"",null,"",null,"",null,null,null,null,null,null,null,null,null,"",""]
["",null,null,null,null,"",null,"",null,"",null,"",null,"",null,"",null,"",null,"",null,"",null,"",null,null,null,null,null,null,null,null,null,"",""]
["",null,null,null,null,"",null,"",null,"",null,"",null,"",null,"",null,"",null,"",null,"",null,"",null,null,null,null,null,null,null,null,null,"",""]
["",null,null,null,null,"",null,"",null,"",null,"",null,"",null,"",null,"",null,"",null,"",null,"",null,null,null,null,null,null,null,null,null,"",""]
["",null,null,null,null,"",null,"",null,"",null,"",null,"",null,"",null,"",null,"",null,"",null,"",null,null,null,null,null,null,null,null,null,"",""]
["",null,null,null,null,"",null,"",null,"",null,"",null,"",null,"",null,"",null,"",null,"",null,"",null,null,null,null,null,null,null,null,null,"",""]
[]
[]
["Übung 1",null,1,true]
[]
["Übung 2",null,2,false]
[]
["Übung 3",null,3,false]
[]
["Übung 4",null,4,true]
[]
["Übung 5",null,6,true]
[]
["Übung 6",null,17,true]
[]
["Übung 7",null,9,true]
[]
["Übung 8",null,19,true]
[]
["Übung 9",null,18,true]
[]
["Übung 10",null,8,true]
[]
["Wahlübung 1",null,null,false]
[]
["Wahlübung 2",null,null,false]

{"sheet":"AK8-9","index":4,"n_rows":83,"n_cols":35,"rows_kept":83,"cut":false,"hidden":false,"merged":[[7,30,8,31],[7,32,8,33],[7,34,8,34],[7,18,8,19],[7,20,8,21],[7,22,8,23],[7,24,8,25],[7,26,8,27],[7,28,8,29],[6,28,6,29],[6,30,6,31],[6,32,6,33],[7,4,8,5],[7,6,8,7],[7,8,8,9],[7,10,8,11],[7,12,8,13],[7,14,8,15],[7,16,8,17],[6,16,6,17],[6,18,6,19],[6,20,6,21],[6,22,6,23],[6,24,6,25],[6,26,6,27],[6,14,6,15],[6,4,6,5],[6,6,6,7],[6,8,6,9],[6,10,6,11],[6,12,6,13]]}
["Altersklasse:",null,null,{"$f":"MID(CELL(\"Dateiname\",$A$1),FIND(\"]\",CELL(\"Dateiname\",$A$1))+1,31)","v":"AK8-9"}]
[]
["Siegzeit Wettkampf m:",null,null,"00:06:30"]
[]
["Siegzeit Wettkampf w:",null,null,"00:07:03.500"]
[]
[null,null,null,null,"Übung 1",null,"Übung 2",null,"Übung 3",null,"Übung 4",null,"Übung 5",null,"Übung 6",null,"Übung 7",null,"Übung 8",null,"Übung 9",null,"Übung 10",null,"Wahl 1",null,"Wahl 2"]
[null,null,null,null,{"$f":"IF(ISBLANK($C$61),\"\",INDEX(exercisesSelect,$C$61,1))","v":"Seilspringen"},null,{"$f":"IF(ISBLANK($C$63),\"\",INDEX(exercisesSelect,$C$63,1))","v":"Rollbrett"},null,{"$f":"IF(ISBLANK($C$65),\"\",INDEX(exercisesSelect,$C$65,1))","v":"Klimmzüge"},null,{"$f":"IF(ISBLANK($C$67),\"\",INDEX(exercisesSelect,$C$67,1))","v":"30m"},null,{"$f":"IF(ISBLANK($C$69),\"\",INDEX(exercisesSelect,$C$69,1))","v":"Hindernis lauf"},null,{"$f":"IF(ISBLANK($C$71),\"\",INDEX(exercisesSelect,$C$71,1))","v":"Kabulauf"},null,{"$f":"IF(ISBLANK($C$73),\"\",INDEX(exercisesSelect,$C$73,1))","v":"Turnbank- Fuß"},null,{"$f":"IF(ISBLANK($C$75),\"\",INDEX(exercisesSelect,$C$75,1))","v":"Turnen"},null,{"$f":"IF(ISBLANK($C$77),\"\",INDEX(exercisesSelect,$C$77,1))","v":"Schlängel lauf"},null,{"$f":"IF(ISBLANK($C$79),\"\",INDEX(exercisesSelect,$C$79,1))","v":"9er-Sprung"},null,{"$f":"IF(ISBLANK($C$81),\"\",INDEX(exercisesSelect,$C$81,1))","v":""},null,{"$f":"IF(ISBLANK($C$83),\"\",INDEX(exercisesSelect,$C$83,1))","v":""},null,"Ring\nschießen",null,"BS / Klapp",null,"Komplex - WK",null,"Punkte"]
[]
["Platz","St-Nr.","Name, Vorname","Verein",null,"Pkt",null,"Pkt",null,"Pkt",null,"Pkt",null,"Pkt",null,"Pkt",null,"Pkt",null,"Pkt",null,"Pkt",null,"Pkt",null,"Pkt",null,"Pkt",null,"Pkt",null,"Pkt",null,"Pkt"]
[{"$f":"IF(ISBLANK(B11),\"\",RANK(AI11,$AI$11:$AI$33))","v":1},43,"KÜHNEL, Luca","SSV Altenberg",39,{"$f":"IF(E11=\"n.a.\",0,IF(ISBLANK(E11),\"\",INDEX(exe_punkte,MATCH(E11,exe_seil_1,1))))","v":0},null,{"$f":"IF(G11=\"n.a.\",0,IF(ISBLANK(G11),\"\",INDEX(exe_punkte,MATCH(G11,exe_roll_1,1))))","v":""},null,{"$f":"IF(I11=\"n.a.\",0,IF(ISBLANK(I11),\"\",INDEX(exe_punkte,MATCH(I11,exe_klimm,1))))","v":""},5.72,{"$f":"IF(K11=\"n.a.\",0,IF(ISBLANK(K11),\"\",INDEX(exe_punkte,MATCH(K11,exe_30m,-1))))","v":8},37.799999999999997,{"$f":"IF(M11=\"n.a.\",0,IF(ISBLANK(M11),\"\",INDEX(exe_punkte,MATCH(M11,exe_hind,-1))))","v":23},15.88,{"$f":"IF(O11=\"n.a.\",0,IF(ISBLANK(O11),\"\",INDEX(exe_punkte,MATCH(O11,exe_kabu,-1))))","v":10},9.44,{"$f":"IF(Q11=\"n.a.\",0,IF(ISBLANK(Q11),\"\",INDEX(exe_punkte,MATCH(Q11,exe_balken,-1))))","v":41},8,{"$f":"IF(S11=\"n.a.\",0,IF(ISBLANK(S11),\"\",INDEX(exe_punkte,MATCH(S11,exe_turn,1))))","v":21},17.3,{"$f":"IF(U11=\"n.a.\",0,IF(ISBLANK(U11),\"\",INDEX(exe_punkte,MATCH(U11,exe_schlaengel,-1))))","v":46},11.7,{"$f":"IF(W11=\"n.a.\",0,IF(ISBLANK(W11),\"\",INDEX(exe_punkte,MATCH(W11,exe_9sprung,1))))","v":18},null,null,null,null,null,null,null,null,"00:07:35.900",{"$f":"IF(AG11=\"n.a.\",0,IF(ISBLANK(AG11),\"\",INDEX(exe_punkte,MATCH(((AG11-$D$3)/$D$3)*100,exe_wk,-1))*2))","v":30},{"$f":"IFERROR(IF(ROW(B11)=ROW(F11),IF(ISBLANK(B11),\"\",SUM(F11,H11,J11,L11,N11,P11,R11,T11,V11,X11,Z11,AB11,AD11,AF11,AH11)),\"Fehler! Ausschneiden nicht erlaubt\"),\"Fehler! Ausschneiden nicht erlaubt\")","v":197}]
[{"$f":"IF(ISBLANK(B12),\"\",RANK(AI12,$AI$11:$AI$33))","v":2},38,"SÜHNEL, Paul","SG Blau-Weiß Zwenkau",112,24,null,"",null,"",6.11,0,42.25,11,18.48,0,10.91,36,10,28,28.1,19,12.6,23,null,null,null,null,null,null,null,null,"00:07:16.200",44,185]
[3,40,"SCHURIG, Martin","SG Stahl Schmiedeberg",34,0,null,"",null,"",5.78,8,52.81,0,21.37,0,15.88,20,7,18,23.7,30,11.1,15,null,null,null,null,null,null,null,null,"00:06:39.700",90,181]
[4,37,"SCHUBERT, Joy","SSV Altenberg",20,0,null,"",null,"",6.13,0,52.53,0,19.66,0,13,30,9,24,29,17,8.1999999999999993,1,null,null,null,null,null,null,null,null,"00:06:58",64,136]
[5,39,"QUITTEK, Johann","SG Blau-Weiß Zwenkau",50,3,null,"",null,"",6.34,0,49.09,0,21.78,0,8.9700000000000006,43,6,15,29.7,15,11.3,16,null,null,null,null,null,null,null,null,"00:08:12.200",10,102]
[6,41,"FRANZ, Mika","SSV Altenberg",null,"",null,"",null,"",null,"",null,"",null,"",null,"",null,"",null,"",null,"",null,null,null,null,null,null,null,null,"00:06:30",100,100]
[7,36,"BRODACZEWSKI, Stanislav","SSV Altenberg",28,0,null,"",null,"",7.99,0,52.5,0,19.88,0,11.38,35,11,32,29,17,8,0,null,null,null,null,null,null,null,null,"00:08:19.300",6,90]
[8,42,"ORGIS, Ole","TSG Sehma",54,4,null,"",null,"",6.6,0,62.9,0,22.3,0,14.25,25,5,12,29.6,16,7.7,0,null,null,null,null,null,null,null,null,"00:08:42.900",0,57]
["",null,null,null,null,{"$f":"IF(E19=\"n.a.\",0,IF(ISBLANK(E19),\"\",INDEX(exe_punkte,MATCH(E19,exe_seil_1,1))))","v":""},null,{"$f":"IF(G19=\"n.a.\",0,IF(ISBLANK(G19),\"\",INDEX(exe_punkte,MATCH(G19,exe_roll_1,1))))","v":""},null,{"$f":"IF(I19=\"n.a.\",0,IF(ISBLANK(I19),\"\",INDEX(exe_punkte,MATCH(I19,exe_klimm,1))))","v":""},null,{"$f":"IF(K19=\"n.a.\",0,IF(ISBLANK(K19),\"\",INDEX(exe_punkte,MATCH(K19,exe_30m,-1))))","v":""},null,{"$f":"IF(M19=\"n.a.\",0,IF(ISBLANK(M19),\"\",INDEX(exe_punkte,MATCH(M19,exe_hind,-1))))","v":""},null,{"$f":"IF(O19=\"n.a.\",0,IF(ISBLANK(O19),\"\",INDEX(exe_punkte,MATCH(O19,exe_kabu,-1))))","v":""},null,{"$f":"IF(Q19=\"n.a.\",0,IF(ISBLANK(Q19),\"\",INDEX(exe_punkte,MATCH(Q19,exe_balken,-1))))","v":""},null,{"$f":"IF(S19=\"n.a.\",0,IF(ISBLANK(S19),\"\",INDEX(exe_punkte,MATCH(S19,exe_turn,1))))","v":""},null,{"$f":"IF(U19=\"n.a.\",0,IF(ISBLANK(U19),\"\",INDEX(exe_punkte,MATCH(U19,exe_schlaengel,-1))))","v":""},null,{"$f":"IF(W19=\"n.a.\",0,IF(ISBLANK(W19),\"\",INDEX(exe_punkte,MATCH(W19,exe_9sprung,1))))","v":""},null,null,null,null,null,null,null,null,null,{"$f":"IF(AG19=\"n.a.\",0,IF(ISBLANK(AG19),\"\",INDEX(exe_punkte,MATCH(((AG19-$D$3)/$D$3)*100,exe_wk,-1))*2))","v":""},{"$f":"IFERROR(IF(ROW(B19)=ROW(F19),IF(ISBLANK(B19),\"\",SUM(F19,H19,J19,L19,N19,P19,R19,T19,V19,X19,Z19,AB19,AD19,AF19,AH19)),\"Fehler! Ausschneiden nicht erlaubt\"),\"Fehler! Ausschneiden nicht erlaubt\")","v":""}]
["",null,null,null,null,"",null,"",null,"",null,"",null,"",null,"",null,"",null,"",null,"",null,"",null,null,null,null,null,null,null,null,null,"",""]
["",null,null,null,null,"",null,"",null,"",null,"",null,"",null,"",null,"",null,"",null,"",null,"",null,null,null,null,null,null,null,null,null,"",""]
["",null,null,null,null,"",null,"",null,"",null,"",null,"",null,"",null,"",null,"",null,"",null,"",null,null,null,null,null,null,null,null,null,"",""]
["",null,null,null,null,"",null,"",null,"",null,"",null,"",null,"",null,"",null,"",null,"",null,"",null,null,null,null,null,null,null,null,null,"",""]
["",null,null,null,null,"",null,"",null,"",null,"",null,"",null,"",null,"",null,"",null,"",null,"",null,null,null,null,null,null,null,null,null,"",""]
["",null,null,null,null,"",null,"",null,"",null,"",null,"",null,"",null,"",null,"",null,"",null,"",null,null,null,null,null,null,null,null,null,"",""]
["",null,null,null,null,"",null,"",null,"",null,"",null,"",null,"",null,"",null,"",null,"",null,"",null,null,null,null,null,null,null,null,null,"",""]
["",null,null,null,null,"",null,"",null,"",null,"",null,"",null,"",null,"",null,"",null,"",null,"",null,null,null,null,null,null,null,null,null,"",""]
["",null,null,null,null,"",null,"",null,"",null,"",null,"",null,"",null,"",null,"",null,"",null,"",null,null,null,null,null,null,null,null,null,"",""]
["",null,null,null,null,"",null,"",null,"",null,"",null,"",null,"",null,"",null,"",null,"",null,"",null,null,null,null,null,null,null,null,null,"",""]
["",null,null,null,null,"",null,"",null,"",null,"",null,"",null,"",null,"",null,"",null,"",null,"",null,null,null,null,null,null,null,null,null,"",""]
["",null,null,null,null,"",null,"",null,"",null,"",null,"",null,"",null,"",null,"",null,"",null,"",null,null,null,null,null,null,null,null,null,"",""]
["",null,null,null,null,"",null,"",null,"",null,"",null,"",null,"",null,"",null,"",null,"",null,"",null,null,null,null,null,null,null,null,null,"",""]
["",null,null,null,null,"",null,"",null,"",null,"",null,"",null,"",null,"",null,"",null,"",null,"",null,null,null,null,null,null,null,null,null,"",""]
[]
["Platz","St-Nr.","Name, Vorname","Verein",null,"Pkt",null,"Pkt",null,"Pkt",null,"Pkt",null,"Pkt",null,"Pkt",null,"Pkt",null,"Pkt",null,"Pkt",null,"Pkt",null,"Pkt",null,"Pkt",null,"Pkt",null,"Pkt",null,"Pkt"]
[{"$f":"IF(ISBLANK(B36),\"\",RANK(AI36,$AI$36:$AI$58))","v":1},55,"GLEDITZSCH, Cora","SSV Altenberg",136,{"$f":"IF(E36=\"n.a.\",0,IF(ISBLANK(E36),\"\",INDEX(exe_punkte,MATCH(E36,exe_seil_1,1))))","v":32},null,{"$f":"IF(G36=\"n.a.\",0,IF(ISBLANK(G36),\"\",INDEX(exe_punkte,MATCH(G36,exe_roll_1,1))))","v":""},null,{"$f":"IF(I36=\"n.a.\",0,IF(ISBLANK(I36),\"\",INDEX(exe_punkte,MATCH(I36,exe_klimm,1))))","v":""},5.53,{"$f":"IF(K36=\"n.a.\",0,IF(ISBLANK(K36),\"\",INDEX(exe_punkte,MATCH(K36,exe_30m,-1))))","v":12},34.65,{"$f":"IF(M36=\"n.a.\",0,IF(ISBLANK(M36),\"\",INDEX(exe_punkte,MATCH(M36,exe_hind,-1))))","v":30},16.04,{"$f":"IF(O36=\"n.a.\",0,IF(ISBLANK(O36),\"\",INDEX(exe_punkte,MATCH(O36,exe_kabu,-1))))","v":9},10.029999999999999,{"$f":"IF(Q36=\"n.a.\",0,IF(ISBLANK(Q36),\"\",INDEX(exe_punkte,MATCH(Q36,exe_balken,-1))))","v":39},10,{"$f":"IF(S36=\"n.a.\",0,IF(ISBLANK(S36),\"\",INDEX(exe_punkte,MATCH(S36,exe_turn,1))))","v":28},25.1,{"$f":"IF(U36=\"n.a.\",0,IF(ISBLANK(U36),\"\",INDEX(exe_punkte,MATCH(U36,exe_schlaengel,-1))))","v":27},12.6,{"$f":"IF(W36=\"n.a.\",0,IF(ISBLANK(W36),\"\",INDEX(exe_punkte,MATCH(W36,exe_9sprung,1))))","v":23},null,null,null,null,null,null,null,null,"00:07:08.500",{"$f":"IF(AG36=\"n.a.\",0,IF(ISBLANK(AG36),\"\",INDEX(exe_punkte,MATCH(((AG36-$D$5)/$D$5)*100,exe_wk,-1))*2))","v":96},{"$f":"IFERROR(IF(ROW(B36)=ROW(F36),IF(ISBLANK(B36),\"\",SUM(F36,H36,J36,L36,N36,P36,R36,T36,V36,X36,Z36,AB36,AD36,AF36,AH36)),\"Fehler! Ausschneiden nicht erlaubt\"),\"Fehler! Ausschneiden nicht erlaubt\")","v":296}]
[{"$f":"IF(ISBLANK(B37),\"\",RANK(AI37,$AI$36:$AI$58))","v":2},56,"HERFORTH, Sofia","Skiclub 1927 Köthen",97,19,null,"",null,"",6.12,0,49.1,0,18.96,0,9.18,42,13,40,27.7,20,11.4,17,null,null,null,null,null,null,null,null,"00:07:03.500",100,238]
[3,46,"WÜSTLING, Judy","PSV Schwarzenberg",100,20,null,"",null,"",5.52,12,41.56,13,16.91,5,7.5,48,9,24,24.5,28,11.8,19,null,null,null,null,null,null,null,null,"00:07:34.200",64,233]
[4,57,"MÜHL, Daria","ATSV Geb.Gelobtland",141,33,null,"",null,"",6.64,0,48.37,0,17.510000000000002,2,9.9700000000000006,40,8,21,26.4,24,10.9,14,null,null,null,null,null,null,null,null,"00:07:31.900",70,204]
[5,49,"PLÖTZ, Greta","Skiclub 1927 Köthen",60,6,null,"",null,"",5.93,4,42.82,10,17.79,1,6.38,50,7,18,22.3,34,10.7,13,null,null,null,null,null,null,null,null,"00:07:44.200",56,192]
[6,50,"SCHWARZ, Virpi","WSC Erzgebirge Oberwiesenthal",24,0,null,"",null,"",5.95,4,41.75,13,16.66,6,11.81,33,9,24,25.6,26,11,15,null,null,null,null,null,null,null,null,"00:07:35.700",64,185]
[7,58,"SÜß, Lena","TSG Sehma",49,3,null,"",null,"",5.97,4,43.47,8,21.21,0,11.16,36,7,18,31.9,10,10.9,14,null,null,null,null,null,null,null,null,"00:07:36.400",64,157]
[8,45,"BONOW, Ria","TSG Sehma",79,13,null,"",null,"",6.18,0,47.97,0,17.89,0,8.7799999999999994,44,10,28,24.6,28,11.5,17,null,null,null,null,null,null,null,null,"00:08:47",14,144]
[9,53,"LÖTZSCH, Zoey","TSG Sehma",65,8,null,"",null,"",6.28,0,50.91,0,17.72,1,12.59,31,9,24,31.4,11,10.4,12,null,null,null,null,null,null,null,null,"00:07:56.300",38,125]
[10,47,"GERBER, Matilda","SG Stahl Schmiedeberg",98,19,null,"",null,"",6.12,0,50.94,0,20.34,0,7.84,47,7,18,22.5,33,6.2,0,null,null,null,null,null,null,null,null,null,"",117]
[11,59,"WALTER, Frida","SG Stahl Schmiedeberg",84,14,null,"",null,"",6.29,0,53.85,0,19.59,0,11.1,36,9,24,25.4,26,10.6,13,null,null,null,null,null,null,null,null,null,"",113]
[12,51,"BRETSCHNEIDER, Flora","SV Hermsdorf",67,9,null,"",null,"",6.93,0,63.97,0,22.24,0,8.44,45,5,12,24.8,28,7.9,0,null,null,null,null,null,null,null,null,"00:09:15.300",0,94]
[13,48,"PÄTZOLD, Malu","SG Stahl Schmiedeberg",30,0,null,"",null,"",7.04,0,56.15,0,21.87,0,18.649999999999999,11,9,24,30.3,14,8.6,3,null,null,null,null,null,null,null,null,null,"",52]
[14,44,"WOLFF, Hanna","TSG Sehma",null,"",null,"",null,"",null,"",null,"",null,"",null,"",null,"",null,"",null,"",null,null,null,null,null,null,null,null,null,"",0]
[14,52,"FROHS, Mirja","TuS Dippoldiswalde",null,"",null,"",null,"",null,"",null,"",null,"",null,"",null,"",null,"",null,"",null,null,null,null,null,null,null,null,null,"",0]
[14,54,"FRANZ, Luise","SSV Altenberg",null,"",null,"",null,"",null,"",null,"",null,"",null,"",null,"",null,"",null,"",null,null,null,null,null,null,null,null,null,"",0]
["",null,null,null,null,{"$f":"IF(E52=\"n.a.\",0,IF(ISBLANK(E52),\"\",INDEX(exe_punkte,MATCH(E52,exe_seil_1,1))))","v":""},null,{"$f":"IF(G52=\"n.a.\",0,IF(ISBLANK(G52),\"\",INDEX(exe_punkte,MATCH(G52,exe_roll_1,1))))","v":""},null,{"$f":"IF(I52=\"n.a.\",0,IF(ISBLANK(I52),\"\",INDEX(exe_punkte,MATCH(I52,exe_klimm,1))))","v":""},null,{"$f":"IF(K52=\"n.a.\",0,IF(ISBLANK(K52),\"\",INDEX(exe_punkte,MATCH(K52,exe_30m,-1))))","v":""},null,{"$f":"IF(M52=\"n.a.\",0,IF(ISBLANK(M52),\"\",INDEX(exe_punkte,MATCH(M52,exe_hind,-1))))","v":""},null,{"$f":"IF(O52=\"n.a.\",0,IF(ISBLANK(O52),\"\",INDEX(exe_punkte,MATCH(O52,exe_kabu,-1))))","v":""},null,{"$f":"IF(Q52=\"n.a.\",0,IF(ISBLANK(Q52),\"\",INDEX(exe_punkte,MATCH(Q52,exe_balken,-1))))","v":""},null,{"$f":"IF(S52=\"n.a.\",0,IF(ISBLANK(S52),\"\",INDEX(exe_punkte,MATCH(S52,exe_turn,1))))","v":""},null,{"$f":"IF(U52=\"n.a.\",0,IF(ISBLANK(U52),\"\",INDEX(exe_punkte,MATCH(U52,exe_schlaengel,-1))))","v":""},null,{"$f":"IF(W52=\"n.a.\",0,IF(ISBLANK(W52),\"\",INDEX(exe_punkte,MATCH(W52,exe_9sprung,1))))","v":""},null,null,null,null,null,null,null,null,null,{"$f":"IF(AG52=\"n.a.\",0,IF(ISBLANK(AG52),\"\",INDEX(exe_punkte,MATCH(((AG52-$D$5)/$D$5)*100,exe_wk,-1))*2))","v":""},{"$f":"IFERROR(IF(ROW(B52)=ROW(F52),IF(ISBLANK(B52),\"\",SUM(F52,H52,J52,L52,N52,P52,R52,T52,V52,X52,Z52,AB52,AD52,AF52,AH52)),\"Fehler! Ausschneiden nicht erlaubt\"),\"Fehler! Ausschneiden nicht erlaubt\")","v":""}]
["",null,null,null,null,"",null,"",null,"",null,"",null,"",null,"",null,"",null,"",null,"",null,"",null,null,null,null,null,null,null,null,null,"",""]
["",null,null,null,null,"",null,"",null,"",null,"",null,"",null,"",null,"",null,"",null,"",null,"",null,null,null,null,null,null,null,null,null,"",""]
["",null,null,null,null,"",null,"",null,"",null,"",null,"",null,"",null,"",null,"",null,"",null,"",null,null,null,null,null,null,null,null,null,"",""]
["",null,null,null,null,"",null,"",null,"",null,"",null,"",null,"",null,"",null,"",null,"",null,"",null,null,null,null,null,null,null,null,null,"",""]
["",null,null,null,null,"",null,"",null,"",null,"",null,"",null,"",null,"",null,"",null,"",null,"",null,null,null,null,null,null,null,null,null,"",""]
["",null,null,null,null,"",null,"",null,"",null,"",null,"",null,"",null,"",null,"",null,"",null,"",null,null,null,null,null,null,null,null,null,"",""]
[]
[]
["Übung 1",null,1,true]
[]
["Übung 2",null,2,false]
[]
["Übung 3",null,3,false]
[]
["Übung 4",null,4,true]
[]
["Übung 5",null,6,true]
[]
["Übung 6",null,17,true]
[]
["Übung 7",null,9,true]
[]
["Übung 8",null,19,true]
[]
["Übung 9",null,18,true]
[]
["Übung 10",null,8,true]
[]
["Wahlübung 1",null,null,false]
[]
["Wahlübung 2",null,null,false]

{"sheet":"AK10","index":5,"n_rows":83,"n_cols":35,"rows_kept":83,"cut":false,"hidden":false,"merged":[[7,30,8,31],[7,32,8,33],[7,34,8,34],[7,18,8,19],[7,20,8,21],[7,22,8,23],[7,24,8,25],[7,26,8,27],[7,28,8,29],[6,28,6,29],[6,30,6,31],[6,32,6,33],[7,4,8,5],[7,6,8,7],[7,8,8,9],[7,10,8,11],[7,12,8,13],[7,14,8,15],[7,16,8,17],[6,16,6,17],[6,18,6,19],[6,20,6,21],[6,22,6,23],[6,24,6,25],[6,26,6,27],[6,14,6,15],[6,4,6,5],[6,6,6,7],[6,8,6,9],[6,10,6,11],[6,12,6,13]]}
["Altersklasse:",null,null,{"$f":"MID(CELL(\"Dateiname\",$A$1),FIND(\"]\",CELL(\"Dateiname\",$A$1))+1,31)","v":"AK10"}]
[]
["Siegzeit Wettkampf m:",null,null,"00:09:33.400"]
[]
["Siegzeit Wettkampf w:",null,null,"00:10:47.900"]
[]
[null,null,null,null,"Übung 1",null,"Übung 2",null,"Übung 3",null,"Übung 4",null,"Übung 5",null,"Übung 6",null,"Übung 7",null,"Übung 8",null,"Übung 9",null,"Übung 10",null,"Wahl 1",null,"Wahl 2"]
[null,null,null,null,{"$f":"IF(ISBLANK($C$61),\"\",INDEX(exercisesSelect,$C$61,1))","v":"Seilspringen"},null,{"$f":"IF(ISBLANK($C$63),\"\",INDEX(exercisesSelect,$C$63,1))","v":"Rollbrett"},null,{"$f":"IF(ISBLANK($C$65),\"\",INDEX(exercisesSelect,$C$65,1))","v":"Klimmzüge"},null,{"$f":"IF(ISBLANK($C$67),\"\",INDEX(exercisesSelect,$C$67,1))","v":"30m"},null,{"$f":"IF(ISBLANK($C$69),\"\",INDEX(exercisesSelect,$C$69,1))","v":"Hindernis lauf"},null,{"$f":"IF(ISBLANK($C$71),\"\",INDEX(exercisesSelect,$C$71,1))","v":"Kabulauf"},null,{"$f":"IF(ISBLANK($C$73),\"\",INDEX(exercisesSelect,$C$73,1))","v":"Slakline"},null,{"$f":"IF(ISBLANK($C$75),\"\",INDEX(exercisesSelect,$C$75,1))","v":"Turnen"},null,{"$f":"IF(ISBLANK($C$77),\"\",INDEX(exercisesSelect,$C$77,1))","v":"9er-Sprung"},null,{"$f":"IF(ISBLANK($C$79),\"\",INDEX(exercisesSelect,$C$79,1))","v":"10er-Sprung schritte"},null,{"$f":"IF(ISBLANK($C$81),\"\",INDEX(exercisesSelect,$C$81,1))","v":""},null,{"$f":"IF(ISBLANK($C$83),\"\",INDEX(exercisesSelect,$C$83,1))","v":""},null,"Ring\nschießen",null,"BS / Klapp",null,"Komplex - WK",null,"Punkte"]
[]
["Platz","St-Nr.","Name, Vorname","Verein",null,"Pkt",null,"Pkt",null,"Pkt",null,"Pkt",null,"Pkt",null,"Pkt",null,"Pkt",null,"Pkt",null,"Pkt",null,"Pkt",null,"Pkt",null,"Pkt",null,"Pkt",null,"Pkt",null,"Pkt"]
[{"$f":"IF(ISBLANK(B11),\"\",RANK(AI11,$AI$11:$AI$33))","v":1},18,"HERFORTH, Leonard","Skiclub 1927 Köthen",131,{"$f":"IF(E11=\"n.a.\",0,IF(ISBLANK(E11),\"\",INDEX(exe_punkte,MATCH(E11,exe_seil_1,1))))","v":30},24,{"$f":"IF(G11=\"n.a.\",0,IF(ISBLANK(G11),\"\",INDEX(exe_punkte,MATCH(G11,exe_roll_1,1))))","v":38},null,{"$f":"IF(I11=\"n.a.\",0,IF(ISBLANK(I11),\"\",INDEX(exe_punkte,MATCH(I11,exe_klimm,1))))","v":""},5.16,{"$f":"IF(K11=\"n.a.\",0,IF(ISBLANK(K11),\"\",INDEX(exe_punkte,MATCH(K11,exe_30m,-1))))","v":20},33.28,{"$f":"IF(M11=\"n.a.\",0,IF(ISBLANK(M11),\"\",INDEX(exe_punkte,MATCH(M11,exe_hind,-1))))","v":34},15.69,{"$f":"IF(O11=\"n.a.\",0,IF(ISBLANK(O11),\"\",INDEX(exe_punkte,MATCH(O11,exe_kabu,-1))))","v":11},2.8,{"$f":"IF(Q11=\"n.a.\",0,IF(ISBLANK(Q11),\"\",INDEX(exe_punkte,MATCH(Q11,exe_slakline_1,1))))","v":28},12,{"$f":"IF(S11=\"n.a.\",0,IF(ISBLANK(S11),\"\",INDEX(exe_punkte,MATCH(S11,exe_turn,1))))","v":36},14.8,{"$f":"IF(U11=\"n.a.\",0,IF(ISBLANK(U11),\"\",INDEX(exe_punkte,MATCH(U11,exe_9sprung,1))))","v":34},null,{"$f":"IF(W11=\"n.a.\",0,IF(ISBLANK(W11),\"\",INDEX(exe_punkte,MATCH(W11,exe_10sprung,1))))","v":""},null,null,null,null,143,{"$f":"IF(AC11=\"n.a.\",0,IF(ISBLANK(AC11),\"\",INDEX(exe_punkte,MATCH(AC11,exe_ring_1,1))))","v":6},null,null,"00:09:33.400",{"$f":"IF(AG11=\"n.a.\",0,IF(ISBLANK(AG11),\"\",INDEX(exe_punkte,MATCH(((AG11-$D$3)/$D$3)*100,exe_wk,-1))*2))","v":100},{"$f":"IFERROR(IF(ROW(B11)=ROW(F11),IF(ISBLANK(B11),\"\",SUM(F11,H11,J11,L11,N11,P11,R11,T11,V11,X11,Z11,AB11,AD11,AF11,AH11)),\"Fehler! Ausschneiden nicht erlaubt\"),\"Fehler! Ausschneiden nicht erlaubt\")","v":337}]
[{"$f":"IF(ISBLANK(B12),\"\",RANK(AI12,$AI$11:$AI$33))","v":2},17,"HAHNHEUSER, Max","SG Stahl Schmiedeberg",83,14,14,9,null,"",5.21,18,40.69,15,18.12,0,1.2,12,9,24,13.6,28,null,"",null,null,null,null,166,21,null,null,"00:11:17.800",26,167]
[3,10,"REIM, Mats-Niklas","TSG Sehma",106,22,15,11,null,"",5.71,8,42.97,10,17.43,2,2.4,24,8,21,13.2,26,null,"",null,null,null,null,166,21,null,null,"00:13:38.800",0,145]
[4,13,"GÖBEL, Gabriel","SG Stahl Schmiedeberg",73,11,11,3,null,"",5.67,10,43.09,9,17.16,4,0.9,9,8,21,12.7,23,null,"",null,null,null,null,134,2,null,null,"00:10:51.100",36,128]
[5,11,"KITZMANN, Emil","Skiclub 1927 Köthen",80,13,20,26,null,"",5.73,8,45.65,3,17.97,0,0.2,2,7,18,11.1,15,null,"",null,null,null,null,148,9,null,null,"00:12:02.200",12,106]
[6,12,"SPECK, Nathan","PSV Schwarzenberg",53,4,11,3,null,"",5.73,8,37.5,23,18.03,0,0.3,3,9,24,11.7,18,null,"",null,null,null,null,139,4,null,null,"00:14:46.400",0,87]
[7,15,"WINDECKER, Tim","SG Stahl Schmiedeberg",99,19,12,5,null,"",5.98,4,52,0,21.56,0,1.2,12,5,12,11,15,null,"",null,null,null,null,153,11,null,null,"00:12:49.500",0,78]
[8,9,"RICHTER, Karol","TuS Dippoldiswalde",34,0,1,0,null,"",5.9,6,48.47,0,18.38,0,1.6,16,8,21,8.8000000000000007,4,null,"",null,null,null,null,161,16,null,null,"00:12:25.200",4,67]
[9,14,"SKLANY, Jamy","SSV Altenberg",40,0,13,7,null,"",5.66,10,37.369999999999997,24,16.43,7,0.5,5,4,9,7.5,0,null,"",null,null,null,null,137,3,null,null,"00:13:55.100",0,65]
[10,16,"DADEMASCH, Neo","SG Stahl Schmiedeberg",36,0,2,0,null,"",5.69,10,48.91,0,22.1,0,1.6,16,6,15,11.2,16,null,"",null,null,null,null,141,5,null,null,"00:13:27.500",0,62]
["",null,null,null,null,{"$f":"IF(E21=\"n.a.\",0,IF(ISBLANK(E21),\"\",INDEX(exe_punkte,MATCH(E21,exe_seil_1,1))))","v":""},null,{"$f":"IF(G21=\"n.a.\",0,IF(ISBLANK(G21),\"\",INDEX(exe_punkte,MATCH(G21,exe_roll_1,1))))","v":""},null,{"$f":"IF(I21=\"n.a.\",0,IF(ISBLANK(I21),\"\",INDEX(exe_punkte,MATCH(I21,exe_klimm,1))))","v":""},null,{"$f":"IF(K21=\"n.a.\",0,IF(ISBLANK(K21),\"\",INDEX(exe_punkte,MATCH(K21,exe_30m,-1))))","v":""},null,{"$f":"IF(M21=\"n.a.\",0,IF(ISBLANK(M21),\"\",INDEX(exe_punkte,MATCH(M21,exe_hind,-1))))","v":""},null,{"$f":"IF(O21=\"n.a.\",0,IF(ISBLANK(O21),\"\",INDEX(exe_punkte,MATCH(O21,exe_kabu,-1))))","v":""},null,{"$f":"IF(Q21=\"n.a.\",0,IF(ISBLANK(Q21),\"\",INDEX(exe_punkte,MATCH(Q21,exe_slakline_1,1))))","v":""},null,{"$f":"IF(S21=\"n.a.\",0,IF(ISBLANK(S21),\"\",INDEX(exe_punkte,MATCH(S21,exe_turn,1))))","v":""},null,{"$f":"IF(U21=\"n.a.\",0,IF(ISBLANK(U21),\"\",INDEX(exe_punkte,MATCH(U21,exe_9sprung,1))))","v":""},null,{"$f":"IF(W21=\"n.a.\",0,IF(ISBLANK(W21),\"\",INDEX(exe_punkte,MATCH(W21,exe_10sprung,1))))","v":""},null,null,null,null,null,{"$f":"IF(AC21=\"n.a.\",0,IF(ISBLANK(AC21),\"\",INDEX(exe_punkte,MATCH(AC21,exe_ring_1,1))))","v":""},null,null,null,{"$f":"IF(AG21=\"n.a.\",0,IF(ISBLANK(AG21),\"\",INDEX(exe_punkte,MATCH(((AG21-$D$3)/$D$3)*100,exe_wk,-1))*2))","v":""},{"$f":"IFERROR(IF(ROW(B21)=ROW(F21),IF(ISBLANK(B21),\"\",SUM(F21,H21,J21,L21,N21,P21,R21,T21,V21,X21,Z21,AB21,AD21,AF21,AH21)),\"Fehler! Ausschneiden nicht erlaubt\"),\"Fehler! Ausschneiden nicht erlaubt\")","v":""}]
["",null,null,null,null,"",null,"",null,"",null,"",null,"",null,"",null,"",null,"",null,"",null,"",null,null,null,null,null,"",null,null,null,"",""]
["",null,null,null,null,"",null,"",null,"",null,"",null,"",null,"",null,"",null,"",null,"",null,"",null,null,null,null,null,"",null,null,null,"",""]
["",null,null,null,null,"",null,"",null,"",null,"",null,"",null,"",null,"",null,"",null,"",null,"",null,null,null,null,null,"",null,null,null,"",""]
["",null,null,null,null,"",null,"",null,"",null,"",null,"",null,"",null,"",null,"",null,"",null,"",null,null,null,null,null,"",null,null,null,"",""]
["",null,null,null,null,"",null,"",null,"",null,"",null,"",null,"",null,"",null,"",null,"",null,"",null,null,null,null,null,"",null,null,null,"",""]
["",null,null,null,null,"",null,"",null,"",null,"",null,"",null,"",null,"",null,"",null,"",null,"",null,null,null,null,null,"",null,null,null,"",""]
["",null,null,null,null,"",null,"",null,"",null,"",null,"",null,"",null,"",null,"",null,"",null,"",null,null,null,null,null,"",null,null,null,"",""]
["",null,null,null,null,"",null,"",null,"",null,"",null,"",null,"",null,"",null,"",null,"",null,"",null,null,null,null,null,"",null,null,null,"",""]
["",null,null,null,null,"",null,"",null,"",null,"",null,"",null,"",null,"",null,"",null,"",null,"",null,null,null,null,null,"",null,null,null,"",""]
["",null,null,null,null,"",null,"",null,"",null,"",null,"",null,"",null,"",null,"",null,"",null,"",null,null,null,null,null,"",null,null,null,"",""]
["",null,null,null,null,"",null,"",null,"",null,"",null,"",null,"",null,"",null,"",null,"",null,"",null,null,null,null,null,"",null,null,null,"",""]
["",null,null,null,null,"",null,"",null,"",null,"",null,"",null,"",null,"",null,"",null,"",null,"",null,null,null,null,null,"",null,null,null,"",""]
[]
["Platz","St-Nr.","Name, Vorname","Verein",null,"Pkt",null,"Pkt",null,"Pkt",null,"Pkt",null,"Pkt",null,"Pkt",null,"Pkt",null,"Pkt",null,"Pkt",null,"Pkt",null,"Pkt",null,"Pkt",null,"Pkt",null,"Pkt",null,"Pkt"]
[{"$f":"IF(ISBLANK(B36),\"\",RANK(AI36,$AI$36:$AI$58))","v":1},35,"BARTZSCH, Frida","TuS Dippoldiswalde",134,{"$f":"IF(E36=\"n.a.\",0,IF(ISBLANK(E36),\"\",INDEX(exe_punkte,MATCH(E36,exe_seil_1,1))))","v":31},12,{"$f":"IF(G36=\"n.a.\",0,IF(ISBLANK(G36),\"\",INDEX(exe_punkte,MATCH(G36,exe_roll_1,1))))","v":5},null,{"$f":"IF(I36=\"n.a.\",0,IF(ISBLANK(I36),\"\",INDEX(exe_punkte,MATCH(I36,exe_klimm,1))))","v":""},5.16,{"$f":"IF(K36=\"n.a.\",0,IF(ISBLANK(K36),\"\",INDEX(exe_punkte,MATCH(K36,exe_30m,-1))))","v":20},30.09,{"$f":"IF(M36=\"n.a.\",0,IF(ISBLANK(M36),\"\",INDEX(exe_punkte,MATCH(M36,exe_hind,-1))))","v":42},13.18,{"$f":"IF(O36=\"n.a.\",0,IF(ISBLANK(O36),\"\",INDEX(exe_punkte,MATCH(O36,exe_kabu,-1))))","v":33},1.7,{"$f":"IF(Q36=\"n.a.\",0,IF(ISBLANK(Q36),\"\",INDEX(exe_punkte,MATCH(Q36,exe_slakline_1,1))))","v":17},12,{"$f":"IF(S36=\"n.a.\",0,IF(ISBLANK(S36),\"\",INDEX(exe_punkte,MATCH(S36,exe_turn,1))))","v":36},14.8,{"$f":"IF(U36=\"n.a.\",0,IF(ISBLANK(U36),\"\",INDEX(exe_punkte,MATCH(U36,exe_9sprung,1))))","v":34},null,{"$f":"IF(W36=\"n.a.\",0,IF(ISBLANK(W36),\"\",INDEX(exe_punkte,MATCH(W36,exe_10sprung,1))))","v":""},null,null,null,null,169,{"$f":"IF(AC36=\"n.a.\",0,IF(ISBLANK(AC36),\"\",INDEX(exe_punkte,MATCH(AC36,exe_ring_1,1))))","v":24},null,null,"00:10:59.200",{"$f":"IF(AG36=\"n.a.\",0,IF(ISBLANK(AG36),\"\",INDEX(exe_punkte,MATCH(((AG36-$D$5)/$D$5)*100,exe_wk,-1))*2))","v":96},{"$f":"IFERROR(IF(ROW(B36)=ROW(F36),IF(ISBLANK(B36),\"\",SUM(F36,H36,J36,L36,N36,P36,R36,T36,V36,X36,Z36,AB36,AD36,AF36,AH36)),\"Fehler! Ausschneiden nicht erlaubt\"),\"Fehler! Ausschneiden nicht erlaubt\")","v":338}]
[{"$f":"IF(ISBLANK(B37),\"\",RANK(AI37,$AI$36:$AI$58))","v":2},34,"SCHÄFER, Hanna","TuS Dippoldiswalde",94,18,20,26,null,"",5.12,20,37.090000000000003,24,15.47,12,1.5,15,8,21,15,35,null,"",null,null,null,null,155,12,null,null,"00:11:33.800",64,247]
[3,26,"GÖHLER, Marta","TuS Dippoldiswalde",103,21,14,9,null,"",5.66,10,35.78,28,15.23,13,1.5,15,10,28,13.9,29,null,"",null,null,null,null,173,28,null,null,"00:11:44.200",60,241]
[3,33,"KADEN, Florintine","SSV Altenberg",130,30,12,5,null,"",5.27,18,34.619999999999997,30,14.78,17,2.7,27,13,40,15.1,35,null,"",null,null,null,null,160,15,null,null,"00:12:54.200",24,241]
[5,32,"BRODACZEWSKA, Alicja","SSV Altenberg",130,30,7,0,null,"",6.18,0,39.28,19,15.59,12,2,20,13,40,12.4,22,null,"",null,null,null,null,159,14,null,null,"00:12:05.900",38,195]
[6,29,"MELDE, Elin","SG Stahl Schmiedeberg",97,19,12,5,null,"",5.56,12,38.880000000000003,20,18.71,0,1.1000000000000001,11,13,40,12.6,23,null,"",null,null,null,null,157,13,null,null,"00:12:28.800",32,175]
[7,30,"JÄGER, Frieda","OBV Ringenhain",75,11,7,0,null,"",5.7,10,39.28,19,17.940000000000001,0,0.9,9,9,24,12.3,21,null,"",null,null,null,null,143,6,null,null,"00:12:59",22,122]
[8,27,"BACHMANN, Hannah","SG Stahl Schmiedeberg",88,16,6,0,null,"",6.04,2,43.88,7,18.190000000000001,0,1.7,17,8,21,10.9,14,null,"",null,null,null,null,161,16,null,null,"00:12:39.300",28,121]
[9,28,"NEUBER, Lina","SG Klotzsche",null,"",null,"",null,"",null,"",null,"",null,"",null,"",null,"",null,"",null,"",null,null,null,null,null,"",null,null,"00:10:47.900",100,100]
[10,31,"BADER, Sissy","SG Stahl Schmiedeberg",null,"",null,"",null,"",null,"",null,"",null,"",null,"",null,"",null,"",null,"",null,null,null,null,null,"",null,null,null,"",0]
["",null,null,null,null,{"$f":"IF(E46=\"n.a.\",0,IF(ISBLANK(E46),\"\",INDEX(exe_punkte,MATCH(E46,exe_seil_1,1))))","v":""},null,{"$f":"IF(G46=\"n.a.\",0,IF(ISBLANK(G46),\"\",INDEX(exe_punkte,MATCH(G46,exe_roll_1,1))))","v":""},null,{"$f":"IF(I46=\"n.a.\",0,IF(ISBLANK(I46),\"\",INDEX(exe_punkte,MATCH(I46,exe_klimm,1))))","v":""},null,{"$f":"IF(K46=\"n.a.\",0,IF(ISBLANK(K46),\"\",INDEX(exe_punkte,MATCH(K46,exe_30m,-1))))","v":""},null,{"$f":"IF(M46=\"n.a.\",0,IF(ISBLANK(M46),\"\",INDEX(exe_punkte,MATCH(M46,exe_hind,-1))))","v":""},null,{"$f":"IF(O46=\"n.a.\",0,IF(ISBLANK(O46),\"\",INDEX(exe_punkte,MATCH(O46,exe_kabu,-1))))","v":""},null,{"$f":"IF(Q46=\"n.a.\",0,IF(ISBLANK(Q46),\"\",INDEX(exe_punkte,MATCH(Q46,exe_slakline_1,1))))","v":""},null,{"$f":"IF(S46=\"n.a.\",0,IF(ISBLANK(S46),\"\",INDEX(exe_punkte,MATCH(S46,exe_turn,1))))","v":""},null,{"$f":"IF(U46=\"n.a.\",0,IF(ISBLANK(U46),\"\",INDEX(exe_punkte,MATCH(U46,exe_9sprung,1))))","v":""},null,{"$f":"IF(W46=\"n.a.\",0,IF(ISBLANK(W46),\"\",INDEX(exe_punkte,MATCH(W46,exe_10sprung,1))))","v":""},null,null,null,null,null,{"$f":"IF(AC46=\"n.a.\",0,IF(ISBLANK(AC46),\"\",INDEX(exe_punkte,MATCH(AC46,exe_ring_1,1))))","v":""},null,null,null,{"$f":"IF(AG46=\"n.a.\",0,IF(ISBLANK(AG46),\"\",INDEX(exe_punkte,MATCH(((AG46-$D$5)/$D$5)*100,exe_wk,-1))*2))","v":""},{"$f":"IFERROR(IF(ROW(B46)=ROW(F46),IF(ISBLANK(B46),\"\",SUM(F46,H46,J46,L46,N46,P46,R46,T46,V46,X46,Z46,AB46,AD46,AF46,AH46)),\"Fehler! Ausschneiden nicht erlaubt\"),\"Fehler! Ausschneiden nicht erlaubt\")","v":""}]
["",null,null,null,null,"",null,"",null,"",null,"",null,"",null,"",null,"",null,"",null,"",null,"",null,null,null,null,null,"",null,null,null,"",""]
["",null,null,null,null,"",null,"",null,"",null,"",null,"",null,"",null,"",null,"",null,"",null,"",null,null,null,null,null,"",null,null,null,"",""]
["",null,null,null,null,"",null,"",null,"",null,"",null,"",null,"",null,"",null,"",null,"",null,"",null,null,null,null,null,"",null,null,null,"",""]
["",null,null,null,null,"",null,"",null,"",null,"",null,"",null,"",null,"",null,"",null,"",null,"",null,null,null,null,null,"",null,null,null,"",""]
["",null,null,null,null,"",null,"",null,"",null,"",null,"",null,"",null,"",null,"",null,"",null,"",null,null,null,null,null,"",null,null,null,"",""]
["",null,null,null,null,"",null,"",null,"",null,"",null,"",null,"",null,"",null,"",null,"",null,"",null,null,null,null,null,"",null,null,null,"",""]
["",null,null,null,null,"",null,"",null,"",null,"",null,"",null,"",null,"",null,"",null,"",null,"",null,null,null,null,null,"",null,null,null,"",""]
["",null,null,null,null,"",null,"",null,"",null,"",null,"",null,"",null,"",null,"",null,"",null,"",null,null,null,null,null,"",null,null,null,"",""]
["",null,null,null,null,"",null,"",null,"",null,"",null,"",null,"",null,"",null,"",null,"",null,"",null,null,null,null,null,"",null,null,null,"",""]
["",null,null,null,null,"",null,"",null,"",null,"",null,"",null,"",null,"",null,"",null,"",null,"",null,null,null,null,null,"",null,null,null,"",""]
["",null,null,null,null,"",null,"",null,"",null,"",null,"",null,"",null,"",null,"",null,"",null,"",null,null,null,null,null,"",null,null,null,"",""]
["",null,null,null,null,"",null,"",null,"",null,"",null,"",null,"",null,"",null,"",null,"",null,"",null,null,null,null,null,"",null,null,null,"",""]
[]
[]
["Übung 1",null,1,true]
[]
["Übung 2",null,2,true]
[]
["Übung 3",null,3,false]
[]
["Übung 4",null,4,true]
[]
["Übung 5",null,6,true]
[]
["Übung 6",null,17,true]
[]
["Übung 7",null,10,true]
[]
["Übung 8",null,19,true]
[]
["Übung 9",null,8,true]
[]
["Übung 10",null,7,false]
[]
["Wahlübung 1",null,null,false]
[]
["Wahlübung 2",null,null,false]

{"sheet":"AK11","index":6,"n_rows":83,"n_cols":35,"rows_kept":83,"cut":false,"hidden":false,"merged":[[7,30,8,31],[7,32,8,33],[7,34,8,34],[7,18,8,19],[7,20,8,21],[7,22,8,23],[7,24,8,25],[7,26,8,27],[7,28,8,29],[6,28,6,29],[6,30,6,31],[6,32,6,33],[7,4,8,5],[7,6,8,7],[7,8,8,9],[7,10,8,11],[7,12,8,13],[7,14,8,15],[7,16,8,17],[6,16,6,17],[6,18,6,19],[6,20,6,21],[6,22,6,23],[6,24,6,25],[6,26,6,27],[6,14,6,15],[6,4,6,5],[6,6,6,7],[6,8,6,9],[6,10,6,11],[6,12,6,13]]}
["Altersklasse:",null,null,{"$f":"MID(CELL(\"Dateiname\",$A$1),FIND(\"]\",CELL(\"Dateiname\",$A$1))+1,31)","v":"AK11"}]
[]
["Siegzeit Wettkampf m:",null,null,"00:10:49.100"]
[]
["Siegzeit Wettkampf w:",null,null,"00:10:30.100"]
[]
[null,null,null,null,"Übung 1",null,"Übung 2",null,"Übung 3",null,"Übung 4",null,"Übung 5",null,"Übung 6",null,"Übung 7",null,"Übung 8",null,"Übung 9",null,"Übung 10",null,"Wahl 1",null,"Wahl 2"]
[null,null,null,null,{"$f":"IF(ISBLANK($C$61),\"\",INDEX(exercisesSelect,$C$61,1))","v":"Seilspringen"},null,{"$f":"IF(ISBLANK($C$63),\"\",INDEX(exercisesSelect,$C$63,1))","v":"Rollbrett"},null,{"$f":"IF(ISBLANK($C$65),\"\",INDEX(exercisesSelect,$C$65,1))","v":"Klimmzüge"},null,{"$f":"IF(ISBLANK($C$67),\"\",INDEX(exercisesSelect,$C$67,1))","v":"30m"},null,{"$f":"IF(ISBLANK($C$69),\"\",INDEX(exercisesSelect,$C$69,1))","v":"Hindernis lauf"},null,{"$f":"IF(ISBLANK($C$71),\"\",INDEX(exercisesSelect,$C$71,1))","v":"Kabulauf"},null,{"$f":"IF(ISBLANK($C$73),\"\",INDEX(exercisesSelect,$C$73,1))","v":"Slakline"},null,{"$f":"IF(ISBLANK($C$75),\"\",INDEX(exercisesSelect,$C$75,1))","v":"Turnen"},null,{"$f":"IF(ISBLANK($C$77),\"\",INDEX(exercisesSelect,$C$77,1))","v":"9er-Sprung"},null,{"$f":"IF(ISBLANK($C$79),\"\",INDEX(exercisesSelect,$C$79,1))","v":"10er-Sprung schritte"},null,{"$f":"IF(ISBLANK($C$81),\"\",INDEX(exercisesSelect,$C$81,1))","v":""},null,{"$f":"IF(ISBLANK($C$83),\"\",INDEX(exercisesSelect,$C$83,1))","v":""},null,"Ring\nschießen",null,"BS / Klapp",null,"Komplex - WK",null,"Punkte"]
[]
["Platz","St-Nr.","Name, Vorname","Verein",null,"Pkt",null,"Pkt",null,"Pkt",null,"Pkt",null,"Pkt",null,"Pkt",null,"Pkt",null,"Pkt",null,"Pkt",null,"Pkt",null,"Pkt",null,"Pkt",null,"Pkt",null,"Pkt",null,"Pkt"]
[{"$f":"IF(ISBLANK(B11),\"\",RANK(AI11,$AI$11:$AI$33))","v":1},3,"SOMMERFELDT, Sten","WSC Erzgebirge Oberwiesenthal",119,{"$f":"IF(E11=\"n.a.\",0,IF(ISBLANK(E11),\"\",INDEX(exe_punkte,MATCH(E11,exe_seil_1,1))))","v":26},16,{"$f":"IF(G11=\"n.a.\",0,IF(ISBLANK(G11),\"\",INDEX(exe_punkte,MATCH(G11,exe_roll_1,1))))","v":14},null,{"$f":"IF(I11=\"n.a.\",0,IF(ISBLANK(I11),\"\",INDEX(exe_punkte,MATCH(I11,exe_klimm,1))))","v":""},4.8,{"$f":"IF(K11=\"n.a.\",0,IF(ISBLANK(K11),\"\",INDEX(exe_punkte,MATCH(K11,exe_30m,-1))))","v":28},31.04,{"$f":"IF(M11=\"n.a.\",0,IF(ISBLANK(M11),\"\",INDEX(exe_punkte,MATCH(M11,exe_hind,-1))))","v":39},13.14,{"$f":"IF(O11=\"n.a.\",0,IF(ISBLANK(O11),\"\",INDEX(exe_punkte,MATCH(O11,exe_kabu,-1))))","v":33},2.1,{"$f":"IF(Q11=\"n.a.\",0,IF(ISBLANK(Q11),\"\",INDEX(exe_punkte,MATCH(Q11,exe_slakline_1,1))))","v":21},11,{"$f":"IF(S11=\"n.a.\",0,IF(ISBLANK(S11),\"\",INDEX(exe_punkte,MATCH(S11,exe_turn,1))))","v":32},16.399999999999999,{"$f":"IF(U11=\"n.a.\",0,IF(ISBLANK(U11),\"\",INDEX(exe_punkte,MATCH(U11,exe_9sprung,1))))","v":42},null,{"$f":"IF(W11=\"n.a.\",0,IF(ISBLANK(W11),\"\",INDEX(exe_punkte,MATCH(W11,exe_10sprung,1))))","v":""},null,null,null,null,175,{"$f":"IF(AC11=\"n.a.\",0,IF(ISBLANK(AC11),\"\",INDEX(exe_punkte,MATCH(AC11,exe_ring_1,1))))","v":30},null,null,"00:10:49.100",{"$f":"IF(AG11=\"n.a.\",0,IF(ISBLANK(AG11),\"\",INDEX(exe_punkte,MATCH(((AG11-$D$3)/$D$3)*100,exe_wk,-1))*2))","v":100},{"$f":"IFERROR(IF(ROW(B11)=ROW(F11),IF(ISBLANK(B11),\"\",SUM(F11,H11,J11,L11,N11,P11,R11,T11,V11,X11,Z11,AB11,AD11,AF11,AH11)),\"Fehler! Ausschneiden nicht erlaubt\"),\"Fehler! Ausschneiden nicht erlaubt\")","v":365}]
[{"$f":"IF(ISBLANK(B12),\"\",RANK(AI12,$AI$11:$AI$33))","v":2},4,"IMHOF, Theodor","SG Stahl Schmiedeberg",154,38,16,14,null,"",5.8,8,41.57,13,18.64,0,0.7,7,8,21,13.4,27,null,"",null,null,null,null,180,35,null,null,"00:10:56.300",96,259]
[3,2,"VOGLER, Arthur","SSV Altenberg",93,17,14,9,null,"",5.2,20,36.6,26,17.64,1,1.7,17,9,24,14.6,33,null,"",null,null,null,null,162,17,null,null,"00:11:22.600",76,240]
[4,6,"RICHTER, Sammy Luca","SG Stahl Schmiedeberg",101,20,10,1,null,"",5.49,14,38.9,20,16.87,5,0.8,8,11,32,13,25,null,"",null,null,null,null,150,10,null,null,"00:11:14.800",86,221]
[5,1,"ALBRECHT, Hans","SG Stahl Schmiedeberg",99,19,10,1,null,"",5.29,18,42.5,11,19.239999999999998,0,1.1000000000000001,11,7,18,14.8,34,null,"",null,null,null,null,153,11,null,null,"00:11:16",82,205]
[5,8,"BÖHME, Elias","TSG Sehma",154,38,10,1,null,"",5.81,6,35.159999999999997,29,16.11,9,0.4,4,8,21,13,25,null,"",null,null,null,null,154,12,null,null,"00:11:43.700",60,205]
[7,7,"GÖTZ, Johann","SV Grün-Weiß-Pirna e.V.",130,30,16,14,null,"",5.8,8,37.5,23,18.38,0,1,10,5,12,11.9,19,null,"",null,null,null,null,151,10,null,null,"00:11:41.100",60,186]
[8,5,"HEYMANN, Kurt","WSC Erzgebirge Oberwiesenthal",104,21,17,17,null,"",5.53,12,40.47,16,16.86,5,0.7,7,11,32,14.1,30,null,"",null,null,null,null,158,14,null,null,"00:15:14.900",0,154]
["",null,null,null,null,{"$f":"IF(E19=\"n.a.\",0,IF(ISBLANK(E19),\"\",INDEX(exe_punkte,MATCH(E19,exe_seil_1,1))))","v":""},null,{"$f":"IF(G19=\"n.a.\",0,IF(ISBLANK(G19),\"\",INDEX(exe_punkte,MATCH(G19,exe_roll_1,1))))","v":""},null,{"$f":"IF(I19=\"n.a.\",0,IF(ISBLANK(I19),\"\",INDEX(exe_punkte,MATCH(I19,exe_klimm,1))))","v":""},null,{"$f":"IF(K19=\"n.a.\",0,IF(ISBLANK(K19),\"\",INDEX(exe_punkte,MATCH(K19,exe_30m,-1))))","v":""},null,{"$f":"IF(M19=\"n.a.\",0,IF(ISBLANK(M19),\"\",INDEX(exe_punkte,MATCH(M19,exe_hind,-1))))","v":""},null,{"$f":"IF(O19=\"n.a.\",0,IF(ISBLANK(O19),\"\",INDEX(exe_punkte,MATCH(O19,exe_kabu,-1))))","v":""},null,{"$f":"IF(Q19=\"n.a.\",0,IF(ISBLANK(Q19),\"\",INDEX(exe_punkte,MATCH(Q19,exe_slakline_1,1))))","v":""},null,{"$f":"IF(S19=\"n.a.\",0,IF(ISBLANK(S19),\"\",INDEX(exe_punkte,MATCH(S19,exe_turn,1))))","v":""},null,{"$f":"IF(U19=\"n.a.\",0,IF(ISBLANK(U19),\"\",INDEX(exe_punkte,MATCH(U19,exe_9sprung,1))))","v":""},null,{"$f":"IF(W19=\"n.a.\",0,IF(ISBLANK(W19),\"\",INDEX(exe_punkte,MATCH(W19,exe_10sprung,1))))","v":""},null,null,null,null,null,{"$f":"IF(AC19=\"n.a.\",0,IF(ISBLANK(AC19),\"\",INDEX(exe_punkte,MATCH(AC19,exe_ring_1,1))))","v":""},null,null,null,{"$f":"IF(AG19=\"n.a.\",0,IF(ISBLANK(AG19),\"\",INDEX(exe_punkte,MATCH(((AG19-$D$3)/$D$3)*100,exe_wk,-1))*2))","v":""},{"$f":"IFERROR(IF(ROW(B19)=ROW(F19),IF(ISBLANK(B19),\"\",SUM(F19,H19,J19,L19,N19,P19,R19,T19,V19,X19,Z19,AB19,AD19,AF19,AH19)),\"Fehler! Ausschneiden nicht erlaubt\"),\"Fehler! Ausschneiden nicht erlaubt\")","v":""}]
["",null,null,null,null,"",null,"",null,"",null,"",null,"",null,"",null,"",null,"",null,"",null,"",null,null,null,null,null,"",null,null,null,"",""]
["",null,null,null,null,"",null,"",null,"",null,"",null,"",null,"",null,"",null,"",null,"",null,"",null,null,null,null,null,"",null,null,null,"",""]
["",null,null,null,null,"",null,"",null,"",null,"",null,"",null,"",null,"",null,"",null,"",null,"",null,null,null,null,null,"",null,null,null,"",""]
["",null,null,null,null,"",null,"",null,"",null,"",null,"",null,"",null,"",null,"",null,"",null,"",null,null,null,null,null,"",null,null,null,"",""]
["",null,null,null,null,"",null,"",null,"",null,"",null,"",null,"",null,"",null,"",null,"",null,"",null,null,null,null,null,"",null,null,null,"",""]
["",null,null,null,null,"",null,"",null,"",null,"",null,"",null,"",null,"",null,"",null,"",null,"",null,null,null,null,null,"",null,null,null,"",""]
["",null,null,null,null,"",null,"",null,"",null,"",null,"",null,"",null,"",null,"",null,"",null,"",null,null,null,null,null,"",null,null,null,"",""]
["",null,null,null,null,"",null,"",null,"",null,"",null,"",null,"",null,"",null,"",null,"",null,"",null,null,null,null,null,"",null,null,null,"",""]
["",null,null,null,null,"",null,"",null,"",null,"",null,"",null,"",null,"",null,"",null,"",null,"",null,null,null,null,null,"",null,null,null,"",""]
["",null,null,null,null,"",null,"",null,"",null,"",null,"",null,"",null,"",null,"",null,"",null,"",null,null,null,null,null,"",null,null,null,"",""]
["",null,null,null,null,"",null,"",null,"",null,"",null,"",null,"",null,"",null,"",null,"",null,"",null,null,null,null,null,"",null,null,null,"",""]
["",null,null,null,null,"",null,"",null,"",null,"",null,"",null,"",null,"",null,"",null,"",null,"",null,null,null,null,null,"",null,null,null,"",""]
["",null,null,null,null,"",null,"",null,"",null,"",null,"",null,"",null,"",null,"",null,"",null,"",null,null,null,null,null,"",null,null,null,"",""]
["",null,null,null,null,"",null,"",null,"",null,"",null,"",null,"",null,"",null,"",null,"",null,"",null,null,null,null,null,"",null,null,null,"",""]
[]
["Platz","St-Nr.","Name, Vorname","Verein",null,"Pkt",null,"Pkt",null,"Pkt",null,"Pkt",null,"Pkt",null,"Pkt",null,"Pkt",null,"Pkt",null,"Pkt",null,"Pkt",null,"Pkt",null,"Pkt",null,"Pkt",null,"Pkt",null,"Pkt"]
[{"$f":"IF(ISBLANK(B36),\"\",RANK(AI36,$AI$36:$AI$58))","v":1},19,"AUERSWALD, Mila","SSV Altenberg",130,{"$f":"IF(E36=\"n.a.\",0,IF(ISBLANK(E36),\"\",INDEX(exe_punkte,MATCH(E36,exe_seil_1,1))))","v":30},19,{"$f":"IF(G36=\"n.a.\",0,IF(ISBLANK(G36),\"\",INDEX(exe_punkte,MATCH(G36,exe_roll_1,1))))","v":23},null,{"$f":"IF(I36=\"n.a.\",0,IF(ISBLANK(I36),\"\",INDEX(exe_punkte,MATCH(I36,exe_klimm,1))))","v":""},5.19,{"$f":"IF(K36=\"n.a.\",0,IF(ISBLANK(K36),\"\",INDEX(exe_punkte,MATCH(K36,exe_30m,-1))))","v":20},34.25,{"$f":"IF(M36=\"n.a.\",0,IF(ISBLANK(M36),\"\",INDEX(exe_punkte,MATCH(M36,exe_hind,-1))))","v":31},16.05,{"$f":"IF(O36=\"n.a.\",0,IF(ISBLANK(O36),\"\",INDEX(exe_punkte,MATCH(O36,exe_kabu,-1))))","v":9},0.7,{"$f":"IF(Q36=\"n.a.\",0,IF(ISBLANK(Q36),\"\",INDEX(exe_punkte,MATCH(Q36,exe_slakline_1,1))))","v":7},13,{"$f":"IF(S36=\"n.a.\",0,IF(ISBLANK(S36),\"\",INDEX(exe_punkte,MATCH(S36,exe_turn,1))))","v":40},14.7,{"$f":"IF(U36=\"n.a.\",0,IF(ISBLANK(U36),\"\",INDEX(exe_punkte,MATCH(U36,exe_9sprung,1))))","v":33},null,{"$f":"IF(W36=\"n.a.\",0,IF(ISBLANK(W36),\"\",INDEX(exe_punkte,MATCH(W36,exe_10sprung,1))))","v":""},null,null,null,null,155,{"$f":"IF(AC36=\"n.a.\",0,IF(ISBLANK(AC36),\"\",INDEX(exe_punkte,MATCH(AC36,exe_ring_1,1))))","v":12},null,null,"00:10:30.100",{"$f":"IF(AG36=\"n.a.\",0,IF(ISBLANK(AG36),\"\",INDEX(exe_punkte,MATCH(((AG36-$D$5)/$D$5)*100,exe_wk,-1))*2))","v":100},{"$f":"IFERROR(IF(ROW(B36)=ROW(F36),IF(ISBLANK(B36),\"\",SUM(F36,H36,J36,L36,N36,P36,R36,T36,V36,X36,Z36,AB36,AD36,AF36,AH36)),\"Fehler! Ausschneiden nicht erlaubt\"),\"Fehler! Ausschneiden nicht erlaubt\")","v":305}]
[{"$f":"IF(ISBLANK(B37),\"\",RANK(AI37,$AI$36:$AI$58))","v":2},24,"HENNIG, Holly","OBV Ringenhain",140,33,12,5,null,"",5.14,20,34.19,32,13.86,26,2,20,13,40,14.7,33,null,"",null,null,null,null,153,11,null,null,"00:12:29.300",26,246]
[3,21,"BORN, Lena","OBV Ringenhain",124,28,7,0,null,"",5.87,6,44.78,5,17.760000000000002,1,1,10,12,36,11.7,18,null,"",null,null,null,null,132,1,null,null,"00:12:10.500",32,137]
[4,20,"BORN, Hanna","OBV Ringenhain",92,17,11,3,null,"",5.92,4,43.79,8,19.79,0,0.6,6,9,24,12,20,null,"",null,null,null,null,154,12,null,null,"00:14:09.300",0,94]
[5,25,"NEUBER, Mia","SG Klotzsche",null,"",null,"",null,"",null,"",null,"",null,"",null,"",null,"",null,"",null,"",null,null,null,null,null,"",null,null,"00:11:17",64,64]
[6,22,"MEJIA, Laila","OBV Ringenhain",null,"",null,"",null,"",null,"",null,"",null,"",null,"",null,"",null,"",null,"",null,null,null,null,null,"",null,null,"00:12:37.600",22,22]
[7,23,"FEHRMANN, Marie","OBV Ringenhain",null,"",null,"",null,"",null,"",null,"",null,"",null,"",null,"",null,"",null,"",null,null,null,null,null,"",null,null,null,"",0]
["",null,null,null,null,{"$f":"IF(E43=\"n.a.\",0,IF(ISBLANK(E43),\"\",INDEX(exe_punkte,MATCH(E43,exe_seil_1,1))))","v":""},null,{"$f":"IF(G43=\"n.a.\",0,IF(ISBLANK(G43),\"\",INDEX(exe_punkte,MATCH(G43,exe_roll_1,1))))","v":""},null,{"$f":"IF(I43=\"n.a.\",0,IF(ISBLANK(I43),\"\",INDEX(exe_punkte,MATCH(I43,exe_klimm,1))))","v":""},null,{"$f":"IF(K43=\"n.a.\",0,IF(ISBLANK(K43),\"\",INDEX(exe_punkte,MATCH(K43,exe_30m,-1))))","v":""},null,{"$f":"IF(M43=\"n.a.\",0,IF(ISBLANK(M43),\"\",INDEX(exe_punkte,MATCH(M43,exe_hind,-1))))","v":""},null,{"$f":"IF(O43=\"n.a.\",0,IF(ISBLANK(O43),\"\",INDEX(exe_punkte,MATCH(O43,exe_kabu,-1))))","v":""},null,{"$f":"IF(Q43=\"n.a.\",0,IF(ISBLANK(Q43),\"\",INDEX(exe_punkte,MATCH(Q43,exe_slakline_1,1))))","v":""},null,{"$f":"IF(S43=\"n.a.\",0,IF(ISBLANK(S43),\"\",INDEX(exe_punkte,MATCH(S43,exe_turn,1))))","v":""},null,{"$f":"IF(U43=\"n.a.\",0,IF(ISBLANK(U43),\"\",INDEX(exe_punkte,MATCH(U43,exe_9sprung,1))))","v":""},null,{"$f":"IF(W43=\"n.a.\",0,IF(ISBLANK(W43),\"\",INDEX(exe_punkte,MATCH(W43,exe_10sprung,1))))","v":""},null,null,null,null,null,{"$f":"IF(AC43=\"n.a.\",0,IF(ISBLANK(AC43),\"\",INDEX(exe_punkte,MATCH(AC43,exe_ring_1,1))))","v":""},null,null,null,{"$f":"IF(AG43=\"n.a.\",0,IF(ISBLANK(AG43),\"\",INDEX(exe_punkte,MATCH(((AG43-$D$5)/$D$5)*100,exe_wk,-1))*2))","v":""},{"$f":"IFERROR(IF(ROW(B43)=ROW(F43),IF(ISBLANK(B43),\"\",SUM(F43,H43,J43,L43,N43,P43,R43,T43,V43,X43,Z43,AB43,AD43,AF43,AH43)),\"Fehler! Ausschneiden nicht erlaubt\"),\"Fehler! Ausschneiden nicht erlaubt\")","v":""}]
["",null,null,null,null,"",null,"",null,"",null,"",null,"",null,"",null,"",null,"",null,"",null,"",null,null,null,null,null,"",null,null,null,"",""]
["",null,null,null,null,"",null,"",null,"",null,"",null,"",null,"",null,"",null,"",null,"",null,"",null,null,null,null,null,"",null,null,null,"",""]
["",null,null,null,null,"",null,"",null,"",null,"",null,"",null,"",null,"",null,"",null,"",null,"",null,null,null,null,null,"",null,null,null,"",""]
["",null,null,null,null,"",null,"",null,"",null,"",null,"",null,"",null,"",null,"",null,"",null,"",null,null,null,null,null,"",null,null,null,"",""]
["",null,null,null,null,"",null,"",null,"",null,"",null,"",null,"",null,"",null,"",null,"",null,"",null,null,null,null,null,"",null,null,null,"",""]
["",null,null,null,null,"",null,"",null,"",null,"",null,"",null,"",null,"",null,"",null,"",null,"",null,null,null,null,null,"",null,null,null,"",""]
["",null,null,null,null,"",null,"",null,"",null,"",null,"",null,"",null,"",null,"",null,"",null,"",null,null,null,null,null,"",null,null,null,"",""]
["",null,null,null,null,"",null,"",null,"",null,"",null,"",null,"",null,"",null,"",null,"",null,"",null,null,null,null,null,"",null,null,null,"",""]
["",null,null,null,null,"",null,"",null,"",null,"",null,"",null,"",null,"",null,"",null,"",null,"",null,null,null,null,null,"",null,null,null,"",""]
["",null,null,null,null,"",null,"",null,"",null,"",null,"",null,"",null,"",null,"",null,"",null,"",null,null,null,null,null,"",null,null,null,"",""]
["",null,null,null,null,"",null,"",null,"",null,"",null,"",null,"",null,"",null,"",null,"",null,"",null,null,null,null,null,"",null,null,null,"",""]
["",null,null,null,null,"",null,"",null,"",null,"",null,"",null,"",null,"",null,"",null,"",null,"",null,null,null,null,null,"",null,null,null,"",""]
["",null,null,null,null,"",null,"",null,"",null,"",null,"",null,"",null,"",null,"",null,"",null,"",null,null,null,null,null,"",null,null,null,"",""]
["",null,null,null,null,"",null,"",null,"",null,"",null,"",null,"",null,"",null,"",null,"",null,"",null,null,null,null,null,"",null,null,null,"",""]
["",null,null,null,null,"",null,"",null,"",null,"",null,"",null,"",null,"",null,"",null,"",null,"",null,null,null,null,null,"",null,null,null,"",""]
[]
[]
["Übung 1",null,1,true]
[]
["Übung 2",null,2,true]
[]
["Übung 3",null,3,false]
[]
["Übung 4",null,4,true]
[]
["Übung 5",null,6,true]
[]
["Übung 6",null,17,true]
[]
["Übung 7",null,10,true]
[]
["Übung 8",null,19,true]
[]
["Übung 9",null,8,true]
[]
["Übung 10",null,7,false]
[]
["Wahlübung 1",null,null,false]
[]
["Wahlübung 2",null,null,false]

{"sheet":"AK12","index":7,"n_rows":83,"n_cols":35,"rows_kept":83,"cut":false,"hidden":false,"merged":[[7,30,8,31],[7,32,8,33],[7,34,8,34],[7,18,8,19],[7,20,8,21],[7,22,8,23],[7,24,8,25],[7,26,8,27],[7,28,8,29],[6,28,6,29],[6,30,6,31],[6,32,6,33],[7,4,8,5],[7,6,8,7],[7,8,8,9],[7,10,8,11],[7,12,8,13],[7,14,8,15],[7,16,8,17],[6,16,6,17],[6,18,6,19],[6,20,6,21],[6,22,6,23],[6,24,6,25],[6,26,6,27],[6,14,6,15],[6,4,6,5],[6,6,6,7],[6,8,6,9],[6,10,6,11],[6,12,6,13]]}
["Altersklasse:",null,null,{"$f":"MID(CELL(\"Dateiname\",$A$1),FIND(\"]\",CELL(\"Dateiname\",$A$1))+1,31)","v":"AK12"}]
[]
["Siegzeit Wettkampf m:",null,null,"00:16:13.400"]
[]
["Siegzeit Wettkampf w:",null,null,"00:17:26.700"]
[]
[null,null,null,null,"Übung 1",null,"Übung 2",null,"Übung 3",null,"Übung 4",null,"Übung 5",null,"Übung 6",null,"Übung 7",null,"Übung 8",null,"Übung 9",null,"Übung 10",null,"Wahl 1",null,"Wahl 2"]
[null,null,null,null,{"$f":"IF(ISBLANK($C$61),\"\",INDEX(exercisesSelect,$C$61,1))","v":"Seilspringen"},null,{"$f":"IF(ISBLANK($C$63),\"\",INDEX(exercisesSelect,$C$63,1))","v":"Rollbrett"},null,{"$f":"IF(ISBLANK($C$65),\"\",INDEX(exercisesSelect,$C$65,1))","v":"Klimmzüge"},null,{"$f":"IF(ISBLANK($C$67),\"\",INDEX(exercisesSelect,$C$67,1))","v":"30m"},null,{"$f":"IF(ISBLANK($C$69),\"\",INDEX(exercisesSelect,$C$69,1))","v":"Hindernis lauf"},null,{"$f":"IF(ISBLANK($C$71),\"\",INDEX(exercisesSelect,$C$71,1))","v":"Kabulauf"},null,{"$f":"IF(ISBLANK($C$73),\"\",INDEX(exercisesSelect,$C$73,1))","v":"Slakline"},null,{"$f":"IF(ISBLANK($C$75),\"\",INDEX(exercisesSelect,$C$75,1))","v":"Turnen"},null,{"$f":"IF(ISBLANK($C$77),\"\",INDEX(exercisesSelect,$C$77,1))","v":"9er-Sprung"},null,{"$f":"IF(ISBLANK($C$79),\"\",INDEX(exercisesSelect,$C$79,1))","v":"10er-Sprung schritte"},null,{"$f":"IF(ISBLANK($C$81),\"\",INDEX(exercisesSelect,$C$81,1))","v":""},null,{"$f":"IF(ISBLANK($C$83),\"\",INDEX(exercisesSelect,$C$83,1))","v":""},null,"Ring\nschießen",null,"BS / Klapp",null,"Komplex - WK",null,"Punkte"]
[]
["Platz","St-Nr.","Name, Vorname","Verein",null,"Pkt",null,"Pkt",null,"Pkt",null,"Pkt",null,"Pkt",null,"Pkt",null,"Pkt",null,"Pkt",null,"Pkt",null,"Pkt",null,"Pkt",null,"Pkt",null,"Pkt",null,"Pkt",null,"Pkt"]
[{"$f":"IF(ISBLANK(B11),\"\",RANK(AI11,$AI$11:$AI$33))","v":1},100,"DREßLER, Vincent","Skiclub 1927 Köthen",293,{"$f":"IF(E11=\"n.a.\",0,IF(ISBLANK(E11),\"\",INDEX(exe_punkte,MATCH(E11,exe_seil_2,1))))","v":36},40,{"$f":"IF(G11=\"n.a.\",0,IF(ISBLANK(G11),\"\",INDEX(exe_punkte,MATCH(G11,exe_roll_2,1))))","v":26},null,{"$f":"IF(I11=\"n.a.\",0,IF(ISBLANK(I11),\"\",INDEX(exe_punkte,MATCH(I11,exe_klimm,1))))","v":""},5.21,{"$f":"IF(K11=\"n.a.\",0,IF(ISBLANK(K11),\"\",INDEX(exe_punkte,MATCH(K11,exe_30m,-1))))","v":18},34.25,{"$f":"IF(M11=\"n.a.\",0,IF(ISBLANK(M11),\"\",INDEX(exe_punkte,MATCH(M11,exe_hind,-1))))","v":31},13.95,{"$f":"IF(O11=\"n.a.\",0,IF(ISBLANK(O11),\"\",INDEX(exe_punkte,MATCH(O11,exe_kabu,-1))))","v":25},5,{"$f":"IF(Q11=\"n.a.\",0,IF(ISBLANK(Q11),\"\",INDEX(exe_punkte,MATCH(Q11,exe_slakline_1,1))))","v":50},11,{"$f":"IF(S11=\"n.a.\",0,IF(ISBLANK(S11),\"\",INDEX(exe_punkte,MATCH(S11,exe_turn,1))))","v":32},null,{"$f":"IF(U11=\"n.a.\",0,IF(ISBLANK(U11),\"\",INDEX(exe_punkte,MATCH(U11,exe_9sprung,1))))","v":""},40,{"$f":"IF(W11=\"n.a.\",0,IF(ISBLANK(W11),\"\",INDEX(exe_punkte,MATCH(W11,exe_10sprung,1))))","v":20},null,null,null,null,176,{"$f":"IF(AC11=\"n.a.\",0,IF(ISBLANK(AC11),\"\",INDEX(exe_punkte,MATCH(AC11,exe_ring_2,1))))","v":31},2,{"$f":"IF(AE11=\"n.a.\",0,IF(ISBLANK(AE11),\"\",INDEX(exe_punkte,MATCH(AE11,exe_klapp,-1))))","v":38},"00:16:44.200",{"$f":"IF(AG11=\"n.a.\",0,IF(ISBLANK(AG11),\"\",INDEX(exe_punkte,MATCH(((AG11-$D$3)/$D$3)*100,exe_wk,-1))*2))","v":86},{"$f":"IFERROR(IF(ROW(B11)=ROW(F11),IF(ISBLANK(B11),\"\",SUM(F11,H11,J11,L11,N11,P11,R11,T11,V11,X11,Z11,AB11,AD11,AF11,AH11)),\"Fehler! Ausschneiden nicht erlaubt\"),\"Fehler! Ausschneiden nicht erlaubt\")","v":393}]
[{"$f":"IF(ISBLANK(B12),\"\",RANK(AI12,$AI$11:$AI$33))","v":2},89,"REIPRICH, John","SG Blau-Weiß Zwenkau",303,38,44,32,null,"",5.29,18,30.16,42,13.97,25,1.2,12,11,32,null,"",51,25,null,null,null,null,126,0,11,0,"00:16:13.400",100,324]
[3,86,"JÄHNE, Anton","OBV Ringenhain",292,35,44,32,null,"",4.92,24,38.5,21,17.12,4,5,50,7,18,null,"",53,26,null,null,null,null,152,11,5,20,"00:17:22.400",64,305]
[4,99,"SCHULZ, Arthur","TuS Dippoldiswalde",311,39,32,14,null,"",5.59,12,33.81,32,13.79,27,5,50,9,24,null,"",33,16,null,null,null,null,153,11,6,14,"00:20:28.300",10,249]
[5,96,"SÜHNEL, Emil","SG Blau-Weiß Zwenkau",266,31,34,17,null,"",5.76,8,31.31,39,13.75,27,2.2000000000000002,22,7,18,null,"",34,17,null,null,null,null,166,21,4,26,"00:19:31.700",22,248]
[6,87,"HAUPTMANN, Timon","SG Stahl Schmiedeberg",295,36,37,20,null,"",5.22,18,35.65,28,18.63,0,2.4,24,12,36,null,"",48,24,null,null,null,null,163,18,6,14,"00:19:27",24,242]
[7,98,"SCHÖNFELDER, Nick","WSC Erzgebirge Oberwiesenthal",236,26,37,20,null,"",5.57,12,40.97,15,16.43,7,4.3,43,6,15,null,"",29,14,null,null,null,null,158,14,4,26,"00:19:20.100",24,216]
[8,91,"HEROLD, Jannis","PSV Schwarzenberg",228,24,35,17,null,"",5.3,18,39.28,19,16.57,7,1.6,16,9,24,null,"",38,19,null,null,null,null,177,32,5,20,"00:24:31.200",0,196]
[9,95,"REUTHER, Theo","SSV Altenberg",282,33,18,0,null,"",4.9400000000000004,24,30.41,41,13.51,29,2.4,24,6,15,null,"",50,25,null,null,null,null,114,0,13,0,"00:20:58.500",4,195]
[10,94,"WOLFF, Jonas","TSG Sehma",234,25,34,17,null,"",5.32,16,39.75,18,14.37,21,1.8,18,6,15,null,"",36,18,null,null,null,null,145,7,14,0,"00:23:54.800",0,155]
[11,85,"PÄTZOLD, Jonas","SG Stahl Schmiedeberg",276,32,16,0,null,"",5.33,16,35.97,27,17.399999999999999,3,1.5,15,9,24,null,"",38,19,null,null,null,null,144,7,7,8,"00:21:55.100",0,151]
[12,88,"KRENZ, Anton","OBV Ringenhain",201,20,25,5,null,"",5.66,10,37.75,23,18.739999999999998,0,1.2,12,7,18,null,"",20,10,null,null,null,null,133,1,6,14,"00:22:44.400",0,113]
[13,93,"GÖDIKER, Fritz","SSV Altenberg",161,13,19,0,null,"",5.72,8,39.78,18,16.38,8,1.2,12,6,15,null,"",35,17,null,null,null,null,127,0,16,0,"00:24:16",0,91]
[14,90,"HÖHNE, Oliver","SG Stahl Schmiedeberg",189,18,4,0,null,"",6.2,0,47.28,0,25.43,0,1.7,17,7,18,null,"",18,9,null,null,null,null,157,13,7,8,"00:22:25.500",0,83]
[15,92,"REICHELT, Linus","SG Klotzsche",null,"",null,"",null,"",null,"",null,"",null,"",null,"",null,"",null,"",null,"",null,null,null,null,null,"",null,"","00:20:27.700",10,10]
[16,97,"BADER, Lorenz","SG Stahl Schmiedeberg",null,"",null,"",null,"",null,"",null,"",null,"",null,"",null,"",null,"",null,"",null,null,null,null,null,"",null,"",null,"",0]
["",null,null,null,null,{"$f":"IF(E27=\"n.a.\",0,IF(ISBLANK(E27),\"\",INDEX(exe_punkte,MATCH(E27,exe_seil_2,1))))","v":""},null,{"$f":"IF(G27=\"n.a.\",0,IF(ISBLANK(G27),\"\",INDEX(exe_punkte,MATCH(G27,exe_roll_2,1))))","v":""},null,{"$f":"IF(I27=\"n.a.\",0,IF(ISBLANK(I27),\"\",INDEX(exe_punkte,MATCH(I27,exe_klimm,1))))","v":""},null,{"$f":"IF(K27=\"n.a.\",0,IF(ISBLANK(K27),\"\",INDEX(exe_punkte,MATCH(K27,exe_30m,-1))))","v":""},null,{"$f":"IF(M27=\"n.a.\",0,IF(ISBLANK(M27),\"\",INDEX(exe_punkte,MATCH(M27,exe_hind,-1))))","v":""},null,{"$f":"IF(O27=\"n.a.\",0,IF(ISBLANK(O27),\"\",INDEX(exe_punkte,MATCH(O27,exe_kabu,-1))))","v":""},null,{"$f":"IF(Q27=\"n.a.\",0,IF(ISBLANK(Q27),\"\",INDEX(exe_punkte,MATCH(Q27,exe_slakline_1,1))))","v":""},null,{"$f":"IF(S27=\"n.a.\",0,IF(ISBLANK(S27),\"\",INDEX(exe_punkte,MATCH(S27,exe_turn,1))))","v":""},null,{"$f":"IF(U27=\"n.a.\",0,IF(ISBLANK(U27),\"\",INDEX(exe_punkte,MATCH(U27,exe_9sprung,1))))","v":""},null,{"$f":"IF(W27=\"n.a.\",0,IF(ISBLANK(W27),\"\",INDEX(exe_punkte,MATCH(W27,exe_10sprung,1))))","v":""},null,null,null,null,null,{"$f":"IF(AC27=\"n.a.\",0,IF(ISBLANK(AC27),\"\",INDEX(exe_punkte,MATCH(AC27,exe_ring_2,1))))","v":""},null,{"$f":"IF(AE27=\"n.a.\",0,IF(ISBLANK(AE27),\"\",INDEX(exe_punkte,MATCH(AE27,exe_klapp,-1))))","v":""},null,{"$f":"IF(AG27=\"n.a.\",0,IF(ISBLANK(AG27),\"\",INDEX(exe_punkte,MATCH(((AG27-$D$3)/$D$3)*100,exe_wk,-1))*2))","v":""},{"$f":"IFERROR(IF(ROW(B27)=ROW(F27),IF(ISBLANK(B27),\"\",SUM(F27,H27,J27,L27,N27,P27,R27,T27,V27,X27,Z27,AB27,AD27,AF27,AH27)),\"Fehler! Ausschneiden nicht erlaubt\"),\"Fehler! Ausschneiden nicht erlaubt\")","v":""}]
["",null,null,null,null,"",null,"",null,"",null,"",null,"",null,"",null,"",null,"",null,"",null,"",null,null,null,null,null,"",null,"",null,"",""]
["",null,null,null,null,"",null,"",null,"",null,"",null,"",null,"",null,"",null,"",null,"",null,"",null,null,null,null,null,"",null,"",null,"",""]
["",null,null,null,null,"",null,"",null,"",null,"",null,"",null,"",null,"",null,"",null,"",null,"",null,null,null,null,null,"",null,"",null,"",""]
["",null,null,null,null,"",null,"",null,"",null,"",null,"",null,"",null,"",null,"",null,"",null,"",null,null,null,null,null,"",null,"",null,"",""]
["",null,null,null,null,"",null,"",null,"",null,"",null,"",null,"",null,"",null,"",null,"",null,"",null,null,null,null,null,"",null,"",null,"",""]
["",null,null,null,null,"",null,"",null,"",null,"",null,"",null,"",null,"",null,"",null,"",null,"",null,null,null,null,null,"",null,"",null,"",""]
[]
["Platz","St-Nr.","Name, Vorname","Verein",null,"Pkt",null,"Pkt",null,"Pkt",null,"Pkt",null,"Pkt",null,"Pkt",null,"Pkt",null,"Pkt",null,"Pkt",null,"Pkt",null,"Pkt",null,"Pkt",null,"Pkt",null,"Pkt",null,"Pkt"]
[{"$f":"IF(ISBLANK(B36),\"\",RANK(AI36,$AI$36:$AI$58))","v":1},126,"MÜHL, Natalie","SSV Altenberg",322,{"$f":"IF(E36=\"n.a.\",0,IF(ISBLANK(E36),\"\",INDEX(exe_punkte,MATCH(E36,exe_seil_2,1))))","v":41},50,{"$f":"IF(G36=\"n.a.\",0,IF(ISBLANK(G36),\"\",INDEX(exe_punkte,MATCH(G36,exe_roll_2,1))))","v":41},null,{"$f":"IF(I36=\"n.a.\",0,IF(ISBLANK(I36),\"\",INDEX(exe_punkte,MATCH(I36,exe_klimm,1))))","v":""},5.36,{"$f":"IF(K36=\"n.a.\",0,IF(ISBLANK(K36),\"\",INDEX(exe_punkte,MATCH(K36,exe_30m,-1))))","v":16},35.15,{"$f":"IF(M36=\"n.a.\",0,IF(ISBLANK(M36),\"\",INDEX(exe_punkte,MATCH(M36,exe_hind,-1))))","v":29},13.66,{"$f":"IF(O36=\"n.a.\",0,IF(ISBLANK(O36),\"\",INDEX(exe_punkte,MATCH(O36,exe_kabu,-1))))","v":28},5,{"$f":"IF(Q36=\"n.a.\",0,IF(ISBLANK(Q36),\"\",INDEX(exe_punkte,MATCH(Q36,exe_slakline_1,1))))","v":50},11,{"$f":"IF(S36=\"n.a.\",0,IF(ISBLANK(S36),\"\",INDEX(exe_punkte,MATCH(S36,exe_turn,1))))","v":32},null,{"$f":"IF(U36=\"n.a.\",0,IF(ISBLANK(U36),\"\",INDEX(exe_punkte,MATCH(U36,exe_9sprung,1))))","v":""},41,{"$f":"IF(W36=\"n.a.\",0,IF(ISBLANK(W36),\"\",INDEX(exe_punkte,MATCH(W36,exe_10sprung,1))))","v":20},null,null,null,null,177,{"$f":"IF(AC36=\"n.a.\",0,IF(ISBLANK(AC36),\"\",INDEX(exe_punkte,MATCH(AC36,exe_ring_2,1))))","v":32},4,{"$f":"IF(AE36=\"n.a.\",0,IF(ISBLANK(AE36),\"\",INDEX(exe_punkte,MATCH(AE36,exe_klapp,-1))))","v":26},"00:17:26.700",{"$f":"IF(AG36=\"n.a.\",0,IF(ISBLANK(AG36),\"\",INDEX(exe_punkte,MATCH(((AG36-$D$5)/$D$5)*100,exe_wk,-1))*2))","v":100},{"$f":"IFERROR(IF(ROW(B36)=ROW(F36),IF(ISBLANK(B36),\"\",SUM(F36,H36,J36,L36,N36,P36,R36,T36,V36,X36,Z36,AB36,AD36,AF36,AH36)),\"Fehler! Ausschneiden nicht erlaubt\"),\"Fehler! Ausschneiden nicht erlaubt\")","v":415}]
[{"$f":"IF(ISBLANK(B37),\"\",RANK(AI37,$AI$36:$AI$58))","v":2},112,"BRODACZEWSKA, Ewa","SSV Altenberg",281,33,35,17,null,"",5.09,22,35.29,29,15.78,11,5,50,11,32,null,"",46,23,null,null,null,null,165,20,0,50,"00:17:50.300",90,377]
[3,118,"ERTHEL, Nathalie","SG Stahl Schmiedeberg",246,27,28,9,null,"",5.26,18,35.6,28,16.690000000000001,6,1.1000000000000001,11,10,28,null,"",31,15,null,null,null,null,161,16,4,26,"00:18:50.200",64,248]
[4,111,"DAMASCHKE, Greta Mariella","SG Klotzsche",193,18,39,23,null,"",5.26,18,39.18,19,13.33,31,1,10,10,28,null,"",35,17,null,null,null,null,136,3,9,0,"00:20:30.200",28,195]
[4,113,"LEHMANN, Mariella","SSV Altenberg",238,26,38,23,null,"",4.9800000000000004,24,37.31,24,16.399999999999999,8,1.1000000000000001,11,11,32,null,"",45,22,null,null,null,null,162,17,7,8,"00:23:55.300",0,195]
[4,120,"CLAUß, Hedwig","OBV Ringenhain",239,26,38,23,null,"",5.57,12,38.869999999999997,20,15.78,11,2.4,24,7,18,null,"",28,14,null,null,null,null,137,3,5,20,"00:20:55.800",24,195]
[7,117,"BLEYL, Lia-Marie","PSV Schwarzenberg",259,29,18,0,null,"",5.0999999999999996,22,37.71,23,14.82,16,0.3,3,11,32,null,"",42,21,null,null,null,null,165,20,9,0,null,"",166]
[8,121,"PISSAREK, Emilia","SV Grün-Weiß-Pirna e.V.",249,28,22,3,null,"",5.56,12,42.5,11,16.36,8,2.2999999999999998,23,9,24,null,"",17,8,null,null,null,null,140,5,5,20,"00:21:56.300",12,154]
[9,116,"MÜLLER, Lea","OBV Ringenhain",268,31,15,0,null,"",5.52,12,41.72,13,19.2,0,0.4,4,10,28,null,"",30,15,null,null,null,null,165,20,5,20,"00:23:05.600",0,143]
[10,114,"BÖHME, Emma","OBV Ringenhain",186,17,19,0,null,"",5.51,12,39.130000000000003,19,16.059999999999999,9,0.9,9,13,40,null,"",28,14,null,null,null,null,151,10,11,0,"00:22:22.300",6,136]
[10,115,"KREITSCHMANN, Holly","Skiclub 1927 Köthen",165,14,21,1,null,"",5.19,20,38.380000000000003,21,17.87,0,1.7,17,7,18,null,"",35,17,null,null,null,null,125,0,12,0,"00:20:29.900",28,136]
[12,119,"HORNA, Lisa","SSV Altenberg",212,22,37,20,null,"",5.69,10,42.53,11,17.72,1,0.5,5,8,21,null,"",31,15,null,null,null,null,136,3,7,8,"00:24:32.100",0,116]
["",null,null,null,null,{"$f":"IF(E48=\"n.a.\",0,IF(ISBLANK(E48),\"\",INDEX(exe_punkte,MATCH(E48,exe_seil_2,1))))","v":""},null,{"$f":"IF(G48=\"n.a.\",0,IF(ISBLANK(G48),\"\",INDEX(exe_punkte,MATCH(G48,exe_roll_2,1))))","v":""},null,{"$f":"IF(I48=\"n.a.\",0,IF(ISBLANK(I48),\"\",INDEX(exe_punkte,MATCH(I48,exe_klimm,1))))","v":""},null,{"$f":"IF(K48=\"n.a.\",0,IF(ISBLANK(K48),\"\",INDEX(exe_punkte,MATCH(K48,exe_30m,-1))))","v":""},null,{"$f":"IF(M48=\"n.a.\",0,IF(ISBLANK(M48),\"\",INDEX(exe_punkte,MATCH(M48,exe_hind,-1))))","v":""},null,{"$f":"IF(O48=\"n.a.\",0,IF(ISBLANK(O48),\"\",INDEX(exe_punkte,MATCH(O48,exe_kabu,-1))))","v":""},null,{"$f":"IF(Q48=\"n.a.\",0,IF(ISBLANK(Q48),\"\",INDEX(exe_punkte,MATCH(Q48,exe_slakline_1,1))))","v":""},null,{"$f":"IF(S48=\"n.a.\",0,IF(ISBLANK(S48),\"\",INDEX(exe_punkte,MATCH(S48,exe_turn,1))))","v":""},null,{"$f":"IF(U48=\"n.a.\",0,IF(ISBLANK(U48),\"\",INDEX(exe_punkte,MATCH(U48,exe_9sprung,1))))","v":""},null,{"$f":"IF(W48=\"n.a.\",0,IF(ISBLANK(W48),\"\",INDEX(exe_punkte,MATCH(W48,exe_10sprung,1))))","v":""},null,null,null,null,null,{"$f":"IF(AC48=\"n.a.\",0,IF(ISBLANK(AC48),\"\",INDEX(exe_punkte,MATCH(AC48,exe_ring_2,1))))","v":""},null,{"$f":"IF(AE48=\"n.a.\",0,IF(ISBLANK(AE48),\"\",INDEX(exe_punkte,MATCH(AE48,exe_klapp,-1))))","v":""},null,{"$f":"IF(AG48=\"n.a.\",0,IF(ISBLANK(AG48),\"\",INDEX(exe_punkte,MATCH(((AG48-$D$5)/$D$5)*100,exe_wk,-1))*2))","v":""},{"$f":"IFERROR(IF(ROW(B48)=ROW(F48),IF(ISBLANK(B48),\"\",SUM(F48,H48,J48,L48,N48,P48,R48,T48,V48,X48,Z48,AB48,AD48,AF48,AH48)),\"Fehler! Ausschneiden nicht erlaubt\"),\"Fehler! Ausschneiden nicht erlaubt\")","v":""}]
["",null,null,null,null,"",null,"",null,"",null,"",null,"",null,"",null,"",null,"",null,"",null,"",null,null,null,null,null,"",null,"",null,"",""]
["",null,null,null,null,"",null,"",null,"",null,"",null,"",null,"",null,"",null,"",null,"",null,"",null,null,null,null,null,"",null,"",null,"",""]
["",null,null,null,null,"",null,"",null,"",null,"",null,"",null,"",null,"",null,"",null,"",null,"",null,null,null,null,null,"",null,"",null,"",""]
["",null,null,null,null,"",null,"",null,"",null,"",null,"",null,"",null,"",null,"",null,"",null,"",null,null,null,null,null,"",null,"",null,"",""]
["",null,null,null,null,"",null,"",null,"",null,"",null,"",null,"",null,"",null,"",null,"",null,"",null,null,null,null,null,"",null,"",null,"",""]
["",null,null,null,null,"",null,"",null,"",null,"",null,"",null,"",null,"",null,"",null,"",null,"",null,null,null,null,null,"",null,"",null,"",""]
["",null,null,null,null,"",null,"",null,"",null,"",null,"",null,"",null,"",null,"",null,"",null,"",null,null,null,null,null,"",null,"",null,"",""]
["",null,null,null,null,"",null,"",null,"",null,"",null,"",null,"",null,"",null,"",null,"",null,"",null,null,null,null,null,"",null,"",null,"",""]
["",null,null,null,null,"",null,"",null,"",null,"",null,"",null,"",null,"",null,"",null,"",null,"",null,null,null,null,null,"",null,"",null,"",""]
["",null,null,null,null,"",null,"",null,"",null,"",null,"",null,"",null,"",null,"",null,"",null,"",null,null,null,null,null,"",null,"",null,"",""]
[]
[]
["Übung 1",null,1,true]
[]
["Übung 2",null,2,true]
[]
["Übung 3",null,3,false]
[]
["Übung 4",null,4,true]
[]
["Übung 5",null,6,true]
[]
["Übung 6",null,17,true]
[]
["Übung 7",null,10,true]
[]
["Übung 8",null,19,true]
[]
["Übung 9",null,8,false]
[]
["Übung 10",null,7,true]
[]
["Wahlübung 1",null,null,false]
[]
["Wahlübung 2",null,null,false]

{"sheet":"AK13","index":8,"n_rows":83,"n_cols":35,"rows_kept":83,"cut":false,"hidden":false,"merged":[[7,30,8,31],[7,32,8,33],[7,34,8,34],[7,18,8,19],[7,20,8,21],[7,22,8,23],[7,24,8,25],[7,26,8,27],[7,28,8,29],[6,28,6,29],[6,30,6,31],[6,32,6,33],[7,4,8,5],[7,6,8,7],[7,8,8,9],[7,10,8,11],[7,12,8,13],[7,14,8,15],[7,16,8,17],[6,16,6,17],[6,18,6,19],[6,20,6,21],[6,22,6,23],[6,24,6,25],[6,26,6,27],[6,14,6,15],[6,4,6,5],[6,6,6,7],[6,8,6,9],[6,10,6,11],[6,12,6,13]]}
["Altersklasse:",null,null,{"$f":"MID(CELL(\"Dateiname\",$A$1),FIND(\"]\",CELL(\"Dateiname\",$A$1))+1,31)","v":"AK13"}]
[]
["Siegzeit Wettkampf m:",null,null,"00:15:03.800"]
[]
["Siegzeit Wettkampf w:",null,null,"00:17:58.300"]
[]
[null,null,null,null,"Übung 1",null,"Übung 2",null,"Übung 3",null,"Übung 4",null,"Übung 5",null,"Übung 6",null,"Übung 7",null,"Übung 8",null,"Übung 9",null,"Übung 10",null,"Wahl 1",null,"Wahl 2"]
[null,null,null,null,{"$f":"IF(ISBLANK($C$61),\"\",INDEX(exercisesSelect,$C$61,1))","v":"Seilspringen"},null,{"$f":"IF(ISBLANK($C$63),\"\",INDEX(exercisesSelect,$C$63,1))","v":"Rollbrett"},null,{"$f":"IF(ISBLANK($C$65),\"\",INDEX(exercisesSelect,$C$65,1))","v":"Klimmzüge"},null,{"$f":"IF(ISBLANK($C$67),\"\",INDEX(exercisesSelect,$C$67,1))","v":"30m"},null,{"$f":"IF(ISBLANK($C$69),\"\",INDEX(exercisesSelect,$C$69,1))","v":"Hindernis lauf"},null,{"$f":"IF(ISBLANK($C$71),\"\",INDEX(exercisesSelect,$C$71,1))","v":"Kabulauf"},null,{"$f":"IF(ISBLANK($C$73),\"\",INDEX(exercisesSelect,$C$73,1))","v":"Slakline"},null,{"$f":"IF(ISBLANK($C$75),\"\",INDEX(exercisesSelect,$C$75,1))","v":"Turnen"},null,{"$f":"IF(ISBLANK($C$77),\"\",INDEX(exercisesSelect,$C$77,1))","v":"9er-Sprung"},null,{"$f":"IF(ISBLANK($C$79),\"\",INDEX(exercisesSelect,$C$79,1))","v":"10er-Sprung schritte"},null,{"$f":"IF(ISBLANK($C$81),\"\",INDEX(exercisesSelect,$C$81,1))","v":""},null,{"$f":"IF(ISBLANK($C$83),\"\",INDEX(exercisesSelect,$C$83,1))","v":""},null,"Ring\nschießen",null,"BS / Klapp",null,"Komplex - WK",null,"Punkte"]
[]
["Platz","St-Nr.","Name, Vorname","Verein",null,"Pkt",null,"Pkt",null,"Pkt",null,"Pkt",null,"Pkt",null,"Pkt",null,"Pkt",null,"Pkt",null,"Pkt",null,"Pkt",null,"Pkt",null,"Pkt",null,"Pkt",null,"Pkt",null,"Pkt"]
[{"$f":"IF(ISBLANK(B11),\"\",RANK(AI11,$AI$11:$AI$33))","v":1},69,"GÖBEL, Arthur","SG Stahl Schmiedeberg",297,{"$f":"IF(E11=\"n.a.\",0,IF(ISBLANK(E11),\"\",INDEX(exe_punkte,MATCH(E11,exe_seil_2,1))))","v":36},48,{"$f":"IF(G11=\"n.a.\",0,IF(ISBLANK(G11),\"\",INDEX(exe_punkte,MATCH(G11,exe_roll_2,1))))","v":38},null,{"$f":"IF(I11=\"n.a.\",0,IF(ISBLANK(I11),\"\",INDEX(exe_punkte,MATCH(I11,exe_klimm,1))))","v":""},4.71,{"$f":"IF(K11=\"n.a.\",0,IF(ISBLANK(K11),\"\",INDEX(exe_punkte,MATCH(K11,exe_30m,-1))))","v":28},32.69,{"$f":"IF(M11=\"n.a.\",0,IF(ISBLANK(M11),\"\",INDEX(exe_punkte,MATCH(M11,exe_hind,-1))))","v":35},13.3,{"$f":"IF(O11=\"n.a.\",0,IF(ISBLANK(O11),\"\",INDEX(exe_punkte,MATCH(O11,exe_kabu,-1))))","v":32},5,{"$f":"IF(Q11=\"n.a.\",0,IF(ISBLANK(Q11),\"\",INDEX(exe_punkte,MATCH(Q11,exe_slakline_1,1))))","v":50},12,{"$f":"IF(S11=\"n.a.\",0,IF(ISBLANK(S11),\"\",INDEX(exe_punkte,MATCH(S11,exe_turn,1))))","v":36},null,{"$f":"IF(U11=\"n.a.\",0,IF(ISBLANK(U11),\"\",INDEX(exe_punkte,MATCH(U11,exe_9sprung,1))))","v":""},62,{"$f":"IF(W11=\"n.a.\",0,IF(ISBLANK(W11),\"\",INDEX(exe_punkte,MATCH(W11,exe_10sprung,1))))","v":31},null,null,null,null,182,{"$f":"IF(AC11=\"n.a.\",0,IF(ISBLANK(AC11),\"\",INDEX(exe_punkte,MATCH(AC11,exe_ring_2,1))))","v":37},0,{"$f":"IF(AE11=\"n.a.\",0,IF(ISBLANK(AE11),\"\",INDEX(exe_punkte,MATCH(AE11,exe_klapp,-1))))","v":50},"00:15:03.800",{"$f":"IF(AG11=\"n.a.\",0,IF(ISBLANK(AG11),\"\",INDEX(exe_punkte,MATCH(((AG11-$D$3)/$D$3)*100,exe_wk,-1))*2))","v":100},{"$f":"IFERROR(IF(ROW(B11)=ROW(F11),IF(ISBLANK(B11),\"\",SUM(F11,H11,J11,L11,N11,P11,R11,T11,V11,X11,Z11,AB11,AD11,AF11,AH11)),\"Fehler! Ausschneiden nicht erlaubt\"),\"Fehler! Ausschneiden nicht erlaubt\")","v":473}]
[{"$f":"IF(ISBLANK(B12),\"\",RANK(AI12,$AI$11:$AI$33))","v":2},77,"GROß, Matti","TSG Sehma",270,31,51,41,null,"",5.1100000000000003,20,33.53,33,13.19,33,5,50,14,45,null,"",64,32,null,null,null,null,156,13,0,50,"00:17:18",34,382]
[3,82,"SCHRÖDER, Johann","PSV Schwarzenberg",328,43,45,32,null,"",4.74,28,32.130000000000003,37,12.95,35,4.2,42,10,28,null,"",70,35,null,null,null,null,162,17,5,20,"00:16:42.700",50,367]
[4,74,"PFAU, Hannes","SG Stahl Schmiedeberg",281,33,45,32,null,"",4.9000000000000004,26,39.5,18,15.47,12,1.6,16,12,36,null,"",38,19,null,null,null,null,169,24,0,50,"00:15:08.800",98,364]
[5,70,"FROHS, Julius","TuS Dippoldiswalde",232,25,48,38,null,"",5.17,20,36.06,27,14.48,20,5,50,11,32,null,"",46,23,null,null,null,null,170,25,4,26,"00:16:40.500",50,336]
[6,75,"BRETSCHNEIDER, Arthur","SV Hermsdorf",304,38,48,38,null,"",5.0999999999999996,22,52.84,0,15.93,10,5,50,10,28,null,"",40,20,null,null,null,null,167,22,4,26,"00:16:38.600",50,304]
[7,67,"BLECHSCHMIDT, Phil","PSV Schwarzenberg",270,31,40,26,null,"",5.0999999999999996,22,36,27,13.07,34,5,50,9,24,null,"",65,32,null,null,null,null,159,14,5,20,"00:18:44.800",14,294]
[8,84,"HAFT, Nick","SV Grün-Weiß-Pirna e.V.",327,42,44,32,null,"",5.0599999999999996,22,37.6,23,13.66,28,5,50,11,32,null,"",57,28,null,null,null,null,155,12,6,14,"00:18:59",10,293]
[9,66,"FRENZEL, Simon","PSV Schwarzenberg",214,22,45,32,null,"",5.01,22,43.03,9,12.98,35,5,50,7,18,null,"",59,29,null,null,null,null,153,11,3,32,"00:18:57.300",12,272]
[10,80,"GRATZKE, Jacob","Skiclub 1927 Köthen",280,33,51,41,null,"",4.88,26,42.19,12,15.48,12,0.7,7,10,28,null,"",45,22,null,null,null,null,162,17,4,26,"00:17:17.500",34,258]
[11,68,"TREBESIUS, Gustaf","OBV Ringenhain",305,38,35,17,null,"",5.24,18,42.03,12,15.26,13,1.9,19,7,18,null,"",58,29,null,null,null,null,156,13,5,20,"00:18:00.800",24,221]
[12,71,"CLAUS, Felix","SG Blau-Weiß Zwenkau",254,29,43,29,null,"",4.95,24,44.96,5,13.51,29,2.5,25,8,21,null,"",40,20,null,null,null,null,139,4,7,8,"00:20:07.700",0,194]
[13,83,"RAABE, Jonas","PSV Schwarzenberg",265,30,41,26,null,"",5.09,22,67.06,0,15.55,12,1.9,19,8,21,null,"",48,24,null,null,null,null,144,7,7,8,"00:19:58.200",0,169]
[14,76,"QUITTEK, Tillmann","SG Blau-Weiß Zwenkau",263,30,39,23,null,"",4.96,24,43.5,8,16.809999999999999,5,0.6,6,6,15,null,"",37,18,null,null,null,null,156,13,6,14,"00:19:16.500",8,164]
[15,73,"MENZEL, Oskar","SG Klotzsche",null,"",53,44,null,"",null,"",null,"",null,"",1.5,15,9,24,null,"",null,"",null,null,null,null,166,21,1,44,null,"",148]
[16,72,"WILDT, Yann","SG Blau-Weiß Zwenkau",245,27,33,14,null,"",5.43,14,45.18,4,16.78,6,2.9,29,11,32,null,"",32,16,null,null,null,null,121,0,16,0,"00:23:10.900",0,142]
[17,81,"KREMCZAK, Leopold","SV Grün-Weiß-Pirna e.V.",178,16,14,0,null,"",5.43,14,48.31,0,18.28,0,0.5,5,8,21,null,"",41,20,null,null,null,null,162,17,2,38,"00:19:23",6,137]
[18,79,"SPECK, Noah","PSV Schwarzenberg",173,15,34,17,null,"",5.48,14,52.03,0,15.94,10,1.4,14,8,21,null,"",34,17,null,null,null,null,154,12,8,2,"00:20:22.800",0,122]
[19,78,"FRITSCHE, Oskar","Skiclub 1927 Köthen",229,24,29,9,null,"",5.09,22,51.47,0,17.13,4,1.2,12,6,15,null,"",28,14,null,null,null,null,140,5,9,0,"00:19:15.800",8,113]
[20,65,"WOLFF, Nathanael","TSG Sehma",209,21,31,11,null,"",5.13,20,58.03,0,18.239999999999998,0,1,10,6,15,null,"",47,23,null,null,null,null,144,7,9,0,"00:20:09.600",0,107]
["",null,null,null,null,{"$f":"IF(E31=\"n.a.\",0,IF(ISBLANK(E31),\"\",INDEX(exe_punkte,MATCH(E31,exe_seil_2,1))))","v":""},null,{"$f":"IF(G31=\"n.a.\",0,IF(ISBLANK(G31),\"\",INDEX(exe_punkte,MATCH(G31,exe_roll_2,1))))","v":""},null,{"$f":"IF(I31=\"n.a.\",0,IF(ISBLANK(I31),\"\",INDEX(exe_punkte,MATCH(I31,exe_klimm,1))))","v":""},null,{"$f":"IF(K31=\"n.a.\",0,IF(ISBLANK(K31),\"\",INDEX(exe_punkte,MATCH(K31,exe_30m,-1))))","v":""},null,{"$f":"IF(M31=\"n.a.\",0,IF(ISBLANK(M31),\"\",INDEX(exe_punkte,MATCH(M31,exe_hind,-1))))","v":""},null,{"$f":"IF(O31=\"n.a.\",0,IF(ISBLANK(O31),\"\",INDEX(exe_punkte,MATCH(O31,exe_kabu,-1))))","v":""},null,{"$f":"IF(Q31=\"n.a.\",0,IF(ISBLANK(Q31),\"\",INDEX(exe_punkte,MATCH(Q31,exe_slakline_1,1))))","v":""},null,{"$f":"IF(S31=\"n.a.\",0,IF(ISBLANK(S31),\"\",INDEX(exe_punkte,MATCH(S31,exe_turn,1))))","v":""},null,{"$f":"IF(U31=\"n.a.\",0,IF(ISBLANK(U31),\"\",INDEX(exe_punkte,MATCH(U31,exe_9sprung,1))))","v":""},null,{"$f":"IF(W31=\"n.a.\",0,IF(ISBLANK(W31),\"\",INDEX(exe_punkte,MATCH(W31,exe_10sprung,1))))","v":""},null,null,null,null,null,{"$f":"IF(AC31=\"n.a.\",0,IF(ISBLANK(AC31),\"\",INDEX(exe_punkte,MATCH(AC31,exe_ring_2,1))))","v":""},null,{"$f":"IF(AE31=\"n.a.\",0,IF(ISBLANK(AE31),\"\",INDEX(exe_punkte,MATCH(AE31,exe_klapp,-1))))","v":""},null,{"$f":"IF(AG31=\"n.a.\",0,IF(ISBLANK(AG31),\"\",INDEX(exe_punkte,MATCH(((AG31-$D$3)/$D$3)*100,exe_wk,-1))*2))","v":""},{"$f":"IFERROR(IF(ROW(B31)=ROW(F31),IF(ISBLANK(B31),\"\",SUM(F31,H31,J31,L31,N31,P31,R31,T31,V31,X31,Z31,AB31,AD31,AF31,AH31)),\"Fehler! Ausschneiden nicht erlaubt\"),\"Fehler! Ausschneiden nicht erlaubt\")","v":""}]
["",null,null,null,null,"",null,"",null,"",null,"",null,"",null,"",null,"",null,"",null,"",null,"",null,null,null,null,null,"",null,"",null,"",""]
["",null,null,null,null,"",null,"",null,"",null,"",null,"",null,"",null,"",null,"",null,"",null,"",null,null,null,null,null,"",null,"",null,"",""]
[]
["Platz","St-Nr.","Name, Vorname","Verein",null,"Pkt",null,"Pkt",null,"Pkt",null,"Pkt",null,"Pkt",null,"Pkt",null,"Pkt",null,"Pkt",null,"Pkt",null,"Pkt",null,"Pkt",null,"Pkt",null,"Pkt",null,"Pkt",null,"Pkt"]
[{"$f":"IF(ISBLANK(B36),\"\",RANK(AI36,$AI$36:$AI$58))","v":1},108,"KAHNT, Anna","SSV Altenberg",319,{"$f":"IF(E36=\"n.a.\",0,IF(ISBLANK(E36),\"\",INDEX(exe_punkte,MATCH(E36,exe_seil_2,1))))","v":41},45,{"$f":"IF(G36=\"n.a.\",0,IF(ISBLANK(G36),\"\",INDEX(exe_punkte,MATCH(G36,exe_roll_2,1))))","v":32},null,{"$f":"IF(I36=\"n.a.\",0,IF(ISBLANK(I36),\"\",INDEX(exe_punkte,MATCH(I36,exe_klimm,1))))","v":""},5.25,{"$f":"IF(K36=\"n.a.\",0,IF(ISBLANK(K36),\"\",INDEX(exe_punkte,MATCH(K36,exe_30m,-1))))","v":18},40.369999999999997,{"$f":"IF(M36=\"n.a.\",0,IF(ISBLANK(M36),\"\",INDEX(exe_punkte,MATCH(M36,exe_hind,-1))))","v":16},13.68,{"$f":"IF(O36=\"n.a.\",0,IF(ISBLANK(O36),\"\",INDEX(exe_punkte,MATCH(O36,exe_kabu,-1))))","v":28},5,{"$f":"IF(Q36=\"n.a.\",0,IF(ISBLANK(Q36),\"\",INDEX(exe_punkte,MATCH(Q36,exe_slakline_1,1))))","v":50},13,{"$f":"IF(S36=\"n.a.\",0,IF(ISBLANK(S36),\"\",INDEX(exe_punkte,MATCH(S36,exe_turn,1))))","v":40},null,{"$f":"IF(U36=\"n.a.\",0,IF(ISBLANK(U36),\"\",INDEX(exe_punkte,MATCH(U36,exe_9sprung,1))))","v":""},57,{"$f":"IF(W36=\"n.a.\",0,IF(ISBLANK(W36),\"\",INDEX(exe_punkte,MATCH(W36,exe_10sprung,1))))","v":28},null,null,null,null,178,{"$f":"IF(AC36=\"n.a.\",0,IF(ISBLANK(AC36),\"\",INDEX(exe_punkte,MATCH(AC36,exe_ring_2,1))))","v":33},0,{"$f":"IF(AE36=\"n.a.\",0,IF(ISBLANK(AE36),\"\",INDEX(exe_punkte,MATCH(AE36,exe_klapp,-1))))","v":50},"00:17:59.700",{"$f":"IF(AG36=\"n.a.\",0,IF(ISBLANK(AG36),\"\",INDEX(exe_punkte,MATCH(((AG36-$D$5)/$D$5)*100,exe_wk,-1))*2))","v":98},{"$f":"IFERROR(IF(ROW(B36)=ROW(F36),IF(ISBLANK(B36),\"\",SUM(F36,H36,J36,L36,N36,P36,R36,T36,V36,X36,Z36,AB36,AD36,AF36,AH36)),\"Fehler! Ausschneiden nicht erlaubt\"),\"Fehler! Ausschneiden nicht erlaubt\")","v":434}]
[{"$f":"IF(ISBLANK(B37),\"\",RANK(AI37,$AI$36:$AI$58))","v":2},102,"VORLICKOVA, Ella","SSV Altenberg",262,30,42,29,null,"",4.75,28,37.659999999999997,23,13.41,30,2.9,29,12,36,null,"",63,31,null,null,null,null,179,34,1,44,"00:17:58.300",100,414]
[3,103,"HERMANN, Malwina","PSV Schwarzenberg",298,37,null,"",null,"",5.04,22,null,"",13.3,32,5,50,15,50,null,"",60,30,null,null,null,null,171,26,2,38,"00:18:04.100",98,383]
[4,109,"NEUBERT, Elli","SSV Altenberg",286,34,48,38,null,"",5.2,20,39.159999999999997,19,15.53,12,5,50,12,36,null,"",42,21,null,null,null,null,164,19,2,38,"00:19:24.200",64,351]
[5,106,"BUSCHE, Emma","PSV Schwarzenberg",260,30,33,14,null,"",5.22,18,46.1,2,15.96,10,5,50,12,36,null,"",51,25,null,null,null,null,161,16,5,20,"00:18:27.400",90,311]
[6,101,"FISCHER, Janessa","SSV Altenberg",289,35,29,9,null,"",5.03,22,40.71,15,14.64,18,5,50,9,24,null,"",58,29,null,null,null,null,162,17,6,14,"00:19:09.100",70,303]
[7,104,"HEYMANN, Merle","WSC Erzgebirge Oberwiesenthal",281,33,30,11,null,"",5.56,12,46.82,0,15.81,10,1.7,17,14,45,null,"",32,16,null,null,null,null,169,24,4,26,"00:18:58.200",76,270]
[8,107,"DRECHSLER, Henny Magdalena","SG Klotzsche",282,33,39,23,null,"",5.25,18,41.65,13,18.16,0,1.1000000000000001,11,10,28,null,"",24,12,null,null,null,null,173,28,2,38,null,"",204]
[9,105,"GLÄSER, Antonia","SSV Altenberg",null,"",31,11,null,"",null,"",null,"",null,"",5,50,13,40,null,"",null,"",null,null,null,null,157,13,5,20,null,"",134]
[10,110,"CLAUS, Luise","SG Blau-Weiß Zwenkau",null,"",null,"",null,"",null,"",null,"",null,"",null,"",null,"",null,"",null,"",null,null,null,null,null,"",null,"",null,"",0]
["",null,null,null,null,{"$f":"IF(E46=\"n.a.\",0,IF(ISBLANK(E46),\"\",INDEX(exe_punkte,MATCH(E46,exe_seil_2,1))))","v":""},null,{"$f":"IF(G46=\"n.a.\",0,IF(ISBLANK(G46),\"\",INDEX(exe_punkte,MATCH(G46,exe_roll_2,1))))","v":""},null,{"$f":"IF(I46=\"n.a.\",0,IF(ISBLANK(I46),\"\",INDEX(exe_punkte,MATCH(I46,exe_klimm,1))))","v":""},null,{"$f":"IF(K46=\"n.a.\",0,IF(ISBLANK(K46),\"\",INDEX(exe_punkte,MATCH(K46,exe_30m,-1))))","v":""},null,{"$f":"IF(M46=\"n.a.\",0,IF(ISBLANK(M46),\"\",INDEX(exe_punkte,MATCH(M46,exe_hind,-1))))","v":""},null,{"$f":"IF(O46=\"n.a.\",0,IF(ISBLANK(O46),\"\",INDEX(exe_punkte,MATCH(O46,exe_kabu,-1))))","v":""},null,{"$f":"IF(Q46=\"n.a.\",0,IF(ISBLANK(Q46),\"\",INDEX(exe_punkte,MATCH(Q46,exe_slakline_1,1))))","v":""},null,{"$f":"IF(S46=\"n.a.\",0,IF(ISBLANK(S46),\"\",INDEX(exe_punkte,MATCH(S46,exe_turn,1))))","v":""},null,{"$f":"IF(U46=\"n.a.\",0,IF(ISBLANK(U46),\"\",INDEX(exe_punkte,MATCH(U46,exe_9sprung,1))))","v":""},null,{"$f":"IF(W46=\"n.a.\",0,IF(ISBLANK(W46),\"\",INDEX(exe_punkte,MATCH(W46,exe_10sprung,1))))","v":""},null,null,null,null,null,{"$f":"IF(AC46=\"n.a.\",0,IF(ISBLANK(AC46),\"\",INDEX(exe_punkte,MATCH(AC46,exe_ring_2,1))))","v":""},null,{"$f":"IF(AE46=\"n.a.\",0,IF(ISBLANK(AE46),\"\",INDEX(exe_punkte,MATCH(AE46,exe_klapp,-1))))","v":""},null,{"$f":"IF(AG46=\"n.a.\",0,IF(ISBLANK(AG46),\"\",INDEX(exe_punkte,MATCH(((AG46-$D$5)/$D$5)*100,exe_wk,-1))*2))","v":""},{"$f":"IFERROR(IF(ROW(B46)=ROW(F46),IF(ISBLANK(B46),\"\",SUM(F46,H46,J46,L46,N46,P46,R46,T46,V46,X46,Z46,AB46,AD46,AF46,AH46)),\"Fehler! Ausschneiden nicht erlaubt\"),\"Fehler! Ausschneiden nicht erlaubt\")","v":""}]
["",null,null,null,null,"",null,"",null,"",null,"",null,"",null,"",null,"",null,"",null,"",null,"",null,null,null,null,null,"",null,"",null,"",""]
["",null,null,null,null,"",null,"",null,"",null,"",null,"",null,"",null,"",null,"",null,"",null,"",null,null,null,null,null,"",null,"",null,"",""]
["",null,null,null,null,"",null,"",null,"",null,"",null,"",null,"",null,"",null,"",null,"",null,"",null,null,null,null,null,"",null,"",null,"",""]
["",null,null,null,null,"",null,"",null,"",null,"",null,"",null,"",null,"",null,"",null,"",null,"",null,null,null,null,null,"",null,"",null,"",""]
["",null,null,null,null,"",null,"",null,"",null,"",null,"",null,"",null,"",null,"",null,"",null,"",null,null,null,null,null,"",null,"",null,"",""]
["",null,null,null,null,"",null,"",null,"",null,"",null,"",null,"",null,"",null,"",null,"",null,"",null,null,null,null,null,"",null,"",null,"",""]
["",null,null,null,null,"",null,"",null,"",null,"",null,"",null,"",null,"",null,"",null,"",null,"",null,null,null,null,null,"",null,"",null,"",""]
["",null,null,null,null,"",null,"",null,"",null,"",null,"",null,"",null,"",null,"",null,"",null,"",null,null,null,null,null,"",null,"",null,"",""]
["",null,null,null,null,"",null,"",null,"",null,"",null,"",null,"",null,"",null,"",null,"",null,"",null,null,null,null,null,"",null,"",null,"",""]
["",null,null,null,null,"",null,"",null,"",null,"",null,"",null,"",null,"",null,"",null,"",null,"",null,null,null,null,null,"",null,"",null,"",""]
["",null,null,null,null,"",null,"",null,"",null,"",null,"",null,"",null,"",null,"",null,"",null,"",null,null,null,null,null,"",null,"",null,"",""]
["",null,null,null,null,"",null,"",null,"",null,"",null,"",null,"",null,"",null,"",null,"",null,"",null,null,null,null,null,"",null,"",null,"",""]
[]
[]
["Übung 1",null,1,true]
[]
["Übung 2",null,2,true]
[]
["Übung 3",null,3,false]
[]
["Übung 4",null,4,true]
[]
["Übung 5",null,6,true]
[]
["Übung 6",null,17,true]
[]
["Übung 7",null,10,true]
[]
["Übung 8",null,19,true]
[]
["Übung 9",null,8,false]
[]
["Übung 10",null,7,true]
[]
["Wahlübung 1",null,null,false]
[]
["Wahlübung 2",null,null,false]

{"sheet":"AK14","index":9,"n_rows":83,"n_cols":35,"rows_kept":83,"cut":false,"hidden":false,"merged":[[7,30,8,31],[7,32,8,33],[7,34,8,34],[7,18,8,19],[7,20,8,21],[7,22,8,23],[7,24,8,25],[7,26,8,27],[7,28,8,29],[6,28,6,29],[6,30,6,31],[6,32,6,33],[7,4,8,5],[7,6,8,7],[7,8,8,9],[7,10,8,11],[7,12,8,13],[7,14,8,15],[7,16,8,17],[6,16,6,17],[6,18,6,19],[6,20,6,21],[6,22,6,23],[6,24,6,25],[6,26,6,27],[6,14,6,15],[6,4,6,5],[6,6,6,7],[6,8,6,9],[6,10,6,11],[6,12,6,13]]}
["Altersklasse:",null,null,{"$f":"MID(CELL(\"Dateiname\",$A$1),FIND(\"]\",CELL(\"Dateiname\",$A$1))+1,31)","v":"AK14"}]
[]
["Siegzeit Wettkampf m:",null,null,"00:19:13.200"]
[]
["Siegzeit Wettkampf w:",null,null,"00:21:05.700"]
[]
[null,null,null,null,"Übung 1",null,"Übung 2",null,"Übung 3",null,"Übung 4",null,"Übung 5",null,"Übung 6",null,"Übung 7",null,"Übung 8",null,"Übung 9",null,"Übung 10",null,"Wahl 1",null,"Wahl 2"]
[null,null,null,null,{"$f":"IF(ISBLANK($C$61),\"\",INDEX(exercisesSelect,$C$61,1))","v":"Seilspringen"},null,{"$f":"IF(ISBLANK($C$63),\"\",INDEX(exercisesSelect,$C$63,1))","v":"Rollbrett"},null,{"$f":"IF(ISBLANK($C$65),\"\",INDEX(exercisesSelect,$C$65,1))","v":"Klimmzüge"},null,{"$f":"IF(ISBLANK($C$67),\"\",INDEX(exercisesSelect,$C$67,1))","v":"30m"},null,{"$f":"IF(ISBLANK($C$69),\"\",INDEX(exercisesSelect,$C$69,1))","v":"Hindernis lauf"},null,{"$f":"IF(ISBLANK($C$71),\"\",INDEX(exercisesSelect,$C$71,1))","v":"Kabulauf"},null,{"$f":"IF(ISBLANK($C$73),\"\",INDEX(exercisesSelect,$C$73,1))","v":"Slakline"},null,{"$f":"IF(ISBLANK($C$75),\"\",INDEX(exercisesSelect,$C$75,1))","v":"Turnen"},null,{"$f":"IF(ISBLANK($C$77),\"\",INDEX(exercisesSelect,$C$77,1))","v":"9er-Sprung"},null,{"$f":"IF(ISBLANK($C$79),\"\",INDEX(exercisesSelect,$C$79,1))","v":"10er-Sprung schritte"},null,{"$f":"IF(ISBLANK($C$81),\"\",INDEX(exercisesSelect,$C$81,1))","v":""},null,{"$f":"IF(ISBLANK($C$83),\"\",INDEX(exercisesSelect,$C$83,1))","v":""},null,"Ring\nschießen",null,"BS / Klapp",null,"Komplex - WK",null,"Punkte"]
[]
["Platz","St-Nr.","Name, Vorname","Verein",null,"Pkt",null,"Pkt",null,"Pkt",null,"Pkt",null,"Pkt",null,"Pkt",null,"Pkt",null,"Pkt",null,"Pkt",null,"Pkt",null,"Pkt",null,"Pkt",null,"Pkt",null,"Pkt",null,"Pkt"]
[{"$f":"IF(ISBLANK(B11),\"\",RANK(AI11,$AI$11:$AI$33))","v":1},135,"FELIX, Kadner","SV Grün-Weiß-Pirna e.V.",483,{"$f":"IF(E11=\"n.a.\",0,IF(ISBLANK(E11),\"\",INDEX(exe_punkte,MATCH(E11,exe_seil_3,1))))","v":41},78,{"$f":"IF(G11=\"n.a.\",0,IF(ISBLANK(G11),\"\",INDEX(exe_punkte,MATCH(G11,exe_roll_3,1))))","v":44},null,{"$f":"IF(I11=\"n.a.\",0,IF(ISBLANK(I11),\"\",INDEX(exe_punkte,MATCH(I11,exe_klimm,1))))","v":""},4.6399999999999997,{"$f":"IF(K11=\"n.a.\",0,IF(ISBLANK(K11),\"\",INDEX(exe_punkte,MATCH(K11,exe_30m,-1))))","v":30},30.4,{"$f":"IF(M11=\"n.a.\",0,IF(ISBLANK(M11),\"\",INDEX(exe_punkte,MATCH(M11,exe_hind,-1))))","v":41},12.03,{"$f":"IF(O11=\"n.a.\",0,IF(ISBLANK(O11),\"\",INDEX(exe_punkte,MATCH(O11,exe_kabu,-1))))","v":44},10,{"$f":"IF(Q11=\"n.a.\",0,IF(ISBLANK(Q11),\"\",INDEX(exe_punkte,MATCH(Q11,exe_slakline_2,1))))","v":50},14,{"$f":"IF(S11=\"n.a.\",0,IF(ISBLANK(S11),\"\",INDEX(exe_punkte,MATCH(S11,exe_turn,1))))","v":45},null,{"$f":"IF(U11=\"n.a.\",0,IF(ISBLANK(U11),\"\",INDEX(exe_punkte,MATCH(U11,exe_9sprung,1))))","v":""},67,{"$f":"IF(W11=\"n.a.\",0,IF(ISBLANK(W11),\"\",INDEX(exe_punkte,MATCH(W11,exe_10sprung,1))))","v":33},null,null,null,null,146,{"$f":"IF(AC11=\"n.a.\",0,IF(ISBLANK(AC11),\"\",INDEX(exe_punkte,MATCH(AC11,exe_ring_3,1))))","v":16},3,{"$f":"IF(AE11=\"n.a.\",0,IF(ISBLANK(AE11),\"\",INDEX(exe_punkte,MATCH(AE11,exe_klapp,-1))))","v":32},"00:19:13.200",{"$f":"IF(AG11=\"n.a.\",0,IF(ISBLANK(AG11),\"\",INDEX(exe_punkte,MATCH(((AG11-$D$3)/$D$3)*100,exe_wk,-1))*2))","v":100},{"$f":"IFERROR(IF(ROW(B11)=ROW(F11),IF(ISBLANK(B11),\"\",SUM(F11,H11,J11,L11,N11,P11,R11,T11,V11,X11,Z11,AB11,AD11,AF11,AH11)),\"Fehler! Ausschneiden nicht erlaubt\"),\"Fehler! Ausschneiden nicht erlaubt\")","v":476}]
[{"$f":"IF(ISBLANK(B12),\"\",RANK(AI12,$AI$11:$AI$33))","v":2},137,"BAUER, Max","WSC Erzgebirge Oberwiesenthal",499,43,73,38,null,"",4.3499999999999996,36,29.07,44,12.64,38,10,50,11.5,32,null,"",85,45,null,null,null,null,149,19,2,38,"00:19:43.600",90,473]
[3,131,"SCHURIG, Kurt","SSV Altenberg LSP",510,44,70,36,null,"",5,24,35.75,28,12.33,41,10,50,14,45,null,"",67,33,null,null,null,null,159,29,1,44,"00:19:23.200",98,472]
[4,141,"SCHURIG, Karl","SSV Altenberg LSP",455,37,69,34,null,"",5,24,34.630000000000003,30,11.26,50,10,50,15,50,null,"",67,33,null,null,null,null,160,30,2,38,"00:22:06.500",32,408]
[5,144,"KÜHNE, Arne","SV Grün-Weiß-Pirna e.V. LSP",478,40,65,29,null,"",5,24,36.340000000000003,26,13.67,28,8.7200000000000006,37,8.5,21,null,"",58,29,null,null,null,null,163,33,1,44,"00:19:31",96,407]
[6,138,"WINTER, Hugo","SSV Altenberg LSP",450,37,73,38,null,"",4.62,30,35.22,29,12.06,44,10,50,11.5,32,null,"",76,38,null,null,null,null,151,21,6,14,"00:21:21.100",44,377]
[7,142,"BOBE, Finn","SSV Altenberg LSP",436,35,72,38,null,"",4.53,32,31.18,39,10.9,50,10,50,10,28,null,"",72,36,null,null,null,null,"n.A.",0,6,14,"00:21:19",50,372]
[8,132,"HANTZSCH, Otto","SV Grün-Weiß-Pirna e.V. LSP",500,43,75,40,null,"",4.6500000000000004,30,40.35,16,14.34,21,10,50,12.5,36,null,"",63,31,null,null,null,null,158,28,3,32,"00:23:01.600",24,351]
[9,139,"DIETRICH, Alwin","WSC Erzgebirge Oberwiesenthal",464,38,64,29,null,"",4.68,30,34.94,30,13.39,31,8,30,8.5,21,null,"",76,38,null,null,null,null,143,13,6,14,"00:20:35.300",64,338]
[10,143,"GLÖCKNER, Hannes","WSC Erzgebirge Oberwiesenthal",472,39,73,38,null,"",4.8,28,34.97,30,12.67,38,3.45,7,12.5,36,null,"",63,31,null,null,null,null,149,19,3,32,"00:22:09.700",32,330]
[11,133,"DERR, Marek","SSV Altenberg LSP",471,39,82,48,null,"",4.6900000000000004,30,42.16,12,13.77,27,5.7,18,12,36,null,"",52,26,null,null,null,null,154,24,4,26,"00:22:30",28,314]
[12,134,"LOMMATZSCH, Matheo","SG Stahl Schmiedeberg LSP",398,30,63,29,null,"",4.9000000000000004,26,35.53,28,13.47,30,3.2,6,10.5,28,null,"",58,29,null,null,null,null,139,9,9,0,"00:20:41.900",64,279]
[13,136,"MESSERSCHMIDT, Nico","SSV Altenberg LSP",434,35,59,23,null,"",5.12,20,38.28,21,13.96,25,6.1,20,9,24,null,"",54,27,null,null,null,null,137,7,5,20,"00:21:31.700",38,260]
[14,140,"LÖTZSCH, Jason","TSG Sehma",366,27,65,29,null,"",5.03,22,37.65,23,13.36,31,5.3,16,10,28,null,"",57,28,null,null,null,null,138,8,12,0,"00:22:33.600",28,240]
[15,146,"PUMP, Leonard","SG Klotzsche",366,27,69,34,null,"",4.8499999999999996,26,34.25,31,14.56,19,2.8,4,8.5,21,null,"",46,23,null,null,null,null,106,0,7,8,"00:24:07.800",12,205]
[16,145,"GÖBEL, Elias","SG Stahl Schmiedeberg LSP",384,29,52,17,null,"",5.07,22,39.479999999999997,18,16.07,9,1.2,0,7,18,null,"",46,23,null,null,null,null,118,0,7,8,"00:22:51.300",26,170]
["",null,null,null,null,{"$f":"IF(E27=\"n.a.\",0,IF(ISBLANK(E27),\"\",INDEX(exe_punkte,MATCH(E27,exe_seil_3,1))))","v":""},null,{"$f":"IF(G27=\"n.a.\",0,IF(ISBLANK(G27),\"\",INDEX(exe_punkte,MATCH(G27,exe_roll_3,1))))","v":""},null,{"$f":"IF(I27=\"n.a.\",0,IF(ISBLANK(I27),\"\",INDEX(exe_punkte,MATCH(I27,exe_klimm,1))))","v":""},null,{"$f":"IF(K27=\"n.a.\",0,IF(ISBLANK(K27),\"\",INDEX(exe_punkte,MATCH(K27,exe_30m,-1))))","v":""},null,{"$f":"IF(M27=\"n.a.\",0,IF(ISBLANK(M27),\"\",INDEX(exe_punkte,MATCH(M27,exe_hind,-1))))","v":""},null,{"$f":"IF(O27=\"n.a.\",0,IF(ISBLANK(O27),\"\",INDEX(exe_punkte,MATCH(O27,exe_kabu,-1))))","v":""},null,{"$f":"IF(Q27=\"n.a.\",0,IF(ISBLANK(Q27),\"\",INDEX(exe_punkte,MATCH(Q27,exe_slakline_2,1))))","v":""},null,{"$f":"IF(S27=\"n.a.\",0,IF(ISBLANK(S27),\"\",INDEX(exe_punkte,MATCH(S27,exe_turn,1))))","v":""},null,{"$f":"IF(U27=\"n.a.\",0,IF(ISBLANK(U27),\"\",INDEX(exe_punkte,MATCH(U27,exe_9sprung,1))))","v":""},null,{"$f":"IF(W27=\"n.a.\",0,IF(ISBLANK(W27),\"\",INDEX(exe_punkte,MATCH(W27,exe_10sprung,1))))","v":""},null,null,null,null,null,{"$f":"IF(AC27=\"n.a.\",0,IF(ISBLANK(AC27),\"\",INDEX(exe_punkte,MATCH(AC27,exe_ring_3,1))))","v":""},null,{"$f":"IF(AE27=\"n.a.\",0,IF(ISBLANK(AE27),\"\",INDEX(exe_punkte,MATCH(AE27,exe_klapp,-1))))","v":""},null,{"$f":"IF(AG27=\"n.a.\",0,IF(ISBLANK(AG27),\"\",INDEX(exe_punkte,MATCH(((AG27-$D$3)/$D$3)*100,exe_wk,-1))*2))","v":""},{"$f":"IFERROR(IF(ROW(B27)=ROW(F27),IF(ISBLANK(B27),\"\",SUM(F27,H27,J27,L27,N27,P27,R27,T27,V27,X27,Z27,AB27,AD27,AF27,AH27)),\"Fehler! Ausschneiden nicht erlaubt\"),\"Fehler! Ausschneiden nicht erlaubt\")","v":""}]
["",null,null,null,null,"",null,"",null,"",null,"",null,"",null,"",null,"",null,"",null,"",null,"",null,null,null,null,null,"",null,"",null,"",""]
["",null,null,null,null,"",null,"",null,"",null,"",null,"",null,"",null,"",null,"",null,"",null,"",null,null,null,null,null,"",null,"",null,"",""]
["",null,null,null,null,"",null,"",null,"",null,"",null,"",null,"",null,"",null,"",null,"",null,"",null,null,null,null,null,"",null,"",null,"",""]
["",null,null,null,null,"",null,"",null,"",null,"",null,"",null,"",null,"",null,"",null,"",null,"",null,null,null,null,null,"",null,"",null,"",""]
["",null,null,null,null,"",null,"",null,"",null,"",null,"",null,"",null,"",null,"",null,"",null,"",null,null,null,null,null,"",null,"",null,"",""]
["",null,null,null,null,"",null,"",null,"",null,"",null,"",null,"",null,"",null,"",null,"",null,"",null,null,null,null,null,"",null,"",null,"",""]
[]
["Platz","St-Nr.","Name, Vorname","Verein",null,"Pkt",null,"Pkt",null,"Pkt",null,"Pkt",null,"Pkt",null,"Pkt",null,"Pkt",null,"Pkt",null,"Pkt",null,"Pkt",null,"Pkt",null,"Pkt",null,"Pkt",null,"Pkt",null,"Pkt"]
[{"$f":"IF(ISBLANK(B36),\"\",RANK(AI36,$AI$36:$AI$58))","v":1},157,"WÜSTLING, Sydney-Laureen","PSV Schwarzenberg",512,{"$f":"IF(E36=\"n.a.\",0,IF(ISBLANK(E36),\"\",INDEX(exe_punkte,MATCH(E36,exe_seil_3,1))))","v":45},79,{"$f":"IF(G36=\"n.a.\",0,IF(ISBLANK(G36),\"\",INDEX(exe_punkte,MATCH(G36,exe_roll_3,1))))","v":44},null,{"$f":"IF(I36=\"n.a.\",0,IF(ISBLANK(I36),\"\",INDEX(exe_punkte,MATCH(I36,exe_klimm,1))))","v":""},4.95,{"$f":"IF(K36=\"n.a.\",0,IF(ISBLANK(K36),\"\",INDEX(exe_punkte,MATCH(K36,exe_30m,-1))))","v":24},33.53,{"$f":"IF(M36=\"n.a.\",0,IF(ISBLANK(M36),\"\",INDEX(exe_punkte,MATCH(M36,exe_hind,-1))))","v":33},14.26,{"$f":"IF(O36=\"n.a.\",0,IF(ISBLANK(O36),\"\",INDEX(exe_punkte,MATCH(O36,exe_kabu,-1))))","v":22},10,{"$f":"IF(Q36=\"n.a.\",0,IF(ISBLANK(Q36),\"\",INDEX(exe_punkte,MATCH(Q36,exe_slakline_2,1))))","v":50},15,{"$f":"IF(S36=\"n.a.\",0,IF(ISBLANK(S36),\"\",INDEX(exe_punkte,MATCH(S36,exe_turn,1))))","v":50},null,{"$f":"IF(U36=\"n.a.\",0,IF(ISBLANK(U36),\"\",INDEX(exe_punkte,MATCH(U36,exe_9sprung,1))))","v":""},57,{"$f":"IF(W36=\"n.a.\",0,IF(ISBLANK(W36),\"\",INDEX(exe_punkte,MATCH(W36,exe_10sprung,1))))","v":28},null,null,null,null,134,{"$f":"IF(AC36=\"n.a.\",0,IF(ISBLANK(AC36),\"\",INDEX(exe_punkte,MATCH(AC36,exe_ring_3,1))))","v":4},2,{"$f":"IF(AE36=\"n.a.\",0,IF(ISBLANK(AE36),\"\",INDEX(exe_punkte,MATCH(AE36,exe_klapp,-1))))","v":38},"00:21:05.700",{"$f":"IF(AG36=\"n.a.\",0,IF(ISBLANK(AG36),\"\",INDEX(exe_punkte,MATCH(((AG36-$D$5)/$D$5)*100,exe_wk,-1))*2))","v":100},{"$f":"IFERROR(IF(ROW(B36)=ROW(F36),IF(ISBLANK(B36),\"\",SUM(F36,H36,J36,L36,N36,P36,R36,T36,V36,X36,Z36,AB36,AD36,AF36,AH36)),\"Fehler! Ausschneiden nicht erlaubt\"),\"Fehler! Ausschneiden nicht erlaubt\")","v":438}]
[{"$f":"IF(ISBLANK(B37),\"\",RANK(AI37,$AI$36:$AI$58))","v":2},160,"GLEDITZSCH, Alexa","SSV Altenberg LSP",447,{"$f":"IF(E37=\"n.a.\",0,IF(ISBLANK(E37),\"\",INDEX(exe_punkte,MATCH(E37,exe_seil_3,1))))","v":36},82,{"$f":"IF(G37=\"n.a.\",0,IF(ISBLANK(G37),\"\",INDEX(exe_punkte,MATCH(G37,exe_roll_3,1))))","v":48},null,{"$f":"IF(I37=\"n.a.\",0,IF(ISBLANK(I37),\"\",INDEX(exe_punkte,MATCH(I37,exe_klimm,1))))","v":""},4.74,{"$f":"IF(K37=\"n.a.\",0,IF(ISBLANK(K37),\"\",INDEX(exe_punkte,MATCH(K37,exe_30m,-1))))","v":28},34.47,{"$f":"IF(M37=\"n.a.\",0,IF(ISBLANK(M37),\"\",INDEX(exe_punkte,MATCH(M37,exe_hind,-1))))","v":31},13.14,{"$f":"IF(O37=\"n.a.\",0,IF(ISBLANK(O37),\"\",INDEX(exe_punkte,MATCH(O37,exe_kabu,-1))))","v":33},10,{"$f":"IF(Q37=\"n.a.\",0,IF(ISBLANK(Q37),\"\",INDEX(exe_punkte,MATCH(Q37,exe_slakline_2,1))))","v":50},15,{"$f":"IF(S37=\"n.a.\",0,IF(ISBLANK(S37),\"\",INDEX(exe_punkte,MATCH(S37,exe_turn,1))))","v":50},null,{"$f":"IF(U37=\"n.a.\",0,IF(ISBLANK(U37),\"\",INDEX(exe_punkte,MATCH(U37,exe_9sprung,1))))","v":""},87,{"$f":"IF(W37=\"n.a.\",0,IF(ISBLANK(W37),\"\",INDEX(exe_punkte,MATCH(W37,exe_10sprung,1))))","v":47},null,null,null,null,148,{"$f":"IF(AC37=\"n.a.\",0,IF(ISBLANK(AC37),\"\",INDEX(exe_punkte,MATCH(AC37,exe_ring_3,1))))","v":18},5,{"$f":"IF(AE37=\"n.a.\",0,IF(ISBLANK(AE37),\"\",INDEX(exe_punkte,MATCH(AE37,exe_klapp,-1))))","v":20},"00:22:10.900",{"$f":"IF(AG37=\"n.a.\",0,IF(ISBLANK(AG37),\"\",INDEX(exe_punkte,MATCH(((AG37-$D$5)/$D$5)*100,exe_wk,-1))*2))","v":76},{"$f":"IFERROR(IF(ROW(B37)=ROW(F37),IF(ISBLANK(B37),\"\",SUM(F37,H37,J37,L37,N37,P37,R37,T37,V37,X37,Z37,AB37,AD37,AF37,AH37)),\"Fehler! Ausschneiden nicht erlaubt\"),\"Fehler! Ausschneiden nicht erlaubt\")","v":437}]
[3,159,"SCHUSTER, Lynn","SSV Altenberg LSP",498,{"$f":"IF(E38=\"n.a.\",0,IF(ISBLANK(E38),\"\",INDEX(exe_punkte,MATCH(E38,exe_seil_3,1))))","v":43},56,{"$f":"IF(G38=\"n.a.\",0,IF(ISBLANK(G38),\"\",INDEX(exe_punkte,MATCH(G38,exe_roll_3,1))))","v":20},null,{"$f":"IF(I38=\"n.a.\",0,IF(ISBLANK(I38),\"\",INDEX(exe_punkte,MATCH(I38,exe_klimm,1))))","v":""},4.66,{"$f":"IF(K38=\"n.a.\",0,IF(ISBLANK(K38),\"\",INDEX(exe_punkte,MATCH(K38,exe_30m,-1))))","v":30},33.07,{"$f":"IF(M38=\"n.a.\",0,IF(ISBLANK(M38),\"\",INDEX(exe_punkte,MATCH(M38,exe_hind,-1))))","v":34},12.08,{"$f":"IF(O38=\"n.a.\",0,IF(ISBLANK(O38),\"\",INDEX(exe_punkte,MATCH(O38,exe_kabu,-1))))","v":44},5.85,{"$f":"IF(Q38=\"n.a.\",0,IF(ISBLANK(Q38),\"\",INDEX(exe_punkte,MATCH(Q38,exe_slakline_2,1))))","v":19},10,{"$f":"IF(S38=\"n.a.\",0,IF(ISBLANK(S38),\"\",INDEX(exe_punkte,MATCH(S38,exe_turn,1))))","v":28},null,{"$f":"IF(U38=\"n.a.\",0,IF(ISBLANK(U38),\"\",INDEX(exe_punkte,MATCH(U38,exe_9sprung,1))))","v":""},80,{"$f":"IF(W38=\"n.a.\",0,IF(ISBLANK(W38),\"\",INDEX(exe_punkte,MATCH(W38,exe_10sprung,1))))","v":40},null,null,null,null,150,{"$f":"IF(AC38=\"n.a.\",0,IF(ISBLANK(AC38),\"\",INDEX(exe_punkte,MATCH(AC38,exe_ring_3,1))))","v":20},5,{"$f":"IF(AE38=\"n.a.\",0,IF(ISBLANK(AE38),\"\",INDEX(exe_punkte,MATCH(AE38,exe_klapp,-1))))","v":20},"00:22:50.700",{"$f":"IF(AG38=\"n.a.\",0,IF(ISBLANK(AG38),\"\",INDEX(exe_punkte,MATCH(((AG38-$D$5)/$D$5)*100,exe_wk,-1))*2))","v":60},{"$f":"IFERROR(IF(ROW(B38)=ROW(F38),IF(ISBLANK(B38),\"\",SUM(F38,H38,J38,L38,N38,P38,R38,T38,V38,X38,Z38,AB38,AD38,AF38,AH38)),\"Fehler! Ausschneiden nicht erlaubt\"),\"Fehler! Ausschneiden nicht erlaubt\")","v":358}]
[4,158,"BASTIAN, Mia","PSV Schwarzenberg",474,{"$f":"IF(E39=\"n.a.\",0,IF(ISBLANK(E39),\"\",INDEX(exe_punkte,MATCH(E39,exe_seil_3,1))))","v":40},42,{"$f":"IF(G39=\"n.a.\",0,IF(ISBLANK(G39),\"\",INDEX(exe_punkte,MATCH(G39,exe_roll_3,1))))","v":9},null,{"$f":"IF(I39=\"n.a.\",0,IF(ISBLANK(I39),\"\",INDEX(exe_punkte,MATCH(I39,exe_klimm,1))))","v":""},4.9800000000000004,{"$f":"IF(K39=\"n.a.\",0,IF(ISBLANK(K39),\"\",INDEX(exe_punkte,MATCH(K39,exe_30m,-1))))","v":24},36.97,{"$f":"IF(M39=\"n.a.\",0,IF(ISBLANK(M39),\"\",INDEX(exe_punkte,MATCH(M39,exe_hind,-1))))","v":25},14.43,{"$f":"IF(O39=\"n.a.\",0,IF(ISBLANK(O39),\"\",INDEX(exe_punkte,MATCH(O39,exe_kabu,-1))))","v":20},1.21,{"$f":"IF(Q39=\"n.a.\",0,IF(ISBLANK(Q39),\"\",INDEX(exe_punkte,MATCH(Q39,exe_slakline_2,1))))","v":0},12.5,{"$f":"IF(S39=\"n.a.\",0,IF(ISBLANK(S39),\"\",INDEX(exe_punkte,MATCH(S39,exe_turn,1))))","v":36},null,{"$f":"IF(U39=\"n.a.\",0,IF(ISBLANK(U39),\"\",INDEX(exe_punkte,MATCH(U39,exe_9sprung,1))))","v":""},58,{"$f":"IF(W39=\"n.a.\",0,IF(ISBLANK(W39),\"\",INDEX(exe_punkte,MATCH(W39,exe_10sprung,1))))","v":29},null,null,null,null,121,{"$f":"IF(AC39=\"n.a.\",0,IF(ISBLANK(AC39),\"\",INDEX(exe_punkte,MATCH(AC39,exe_ring_3,1))))","v":0},6,{"$f":"IF(AE39=\"n.a.\",0,IF(ISBLANK(AE39),\"\",INDEX(exe_punkte,MATCH(AE39,exe_klapp,-1))))","v":14},"00:26:15.500",{"$f":"IF(AG39=\"n.a.\",0,IF(ISBLANK(AG39),\"\",INDEX(exe_punkte,MATCH(((AG39-$D$5)/$D$5)*100,exe_wk,-1))*2))","v":14},{"$f":"IFERROR(IF(ROW(B39)=ROW(F39),IF(ISBLANK(B39),\"\",SUM(F39,H39,J39,L39,N39,P39,R39,T39,V39,X39,Z39,AB39,AD39,AF39,AH39)),\"Fehler! Ausschneiden nicht erlaubt\"),\"Fehler! Ausschneiden nicht erlaubt\")","v":211}]
[5,161,"BERGT, Selina","SG Klotzsche LSP",405,{"$f":"IF(E40=\"n.a.\",0,IF(ISBLANK(E40),\"\",INDEX(exe_punkte,MATCH(E40,exe_seil_3,1))))","v":31},53,{"$f":"IF(G40=\"n.a.\",0,IF(ISBLANK(G40),\"\",INDEX(exe_punkte,MATCH(G40,exe_roll_3,1))))","v":17},null,{"$f":"IF(I40=\"n.a.\",0,IF(ISBLANK(I40),\"\",INDEX(exe_punkte,MATCH(I40,exe_klimm,1))))","v":""},5,{"$f":"IF(K40=\"n.a.\",0,IF(ISBLANK(K40),\"\",INDEX(exe_punkte,MATCH(K40,exe_30m,-1))))","v":24},52.75,{"$f":"IF(M40=\"n.a.\",0,IF(ISBLANK(M40),\"\",INDEX(exe_punkte,MATCH(M40,exe_hind,-1))))","v":0},15.66,{"$f":"IF(O40=\"n.a.\",0,IF(ISBLANK(O40),\"\",INDEX(exe_punkte,MATCH(O40,exe_kabu,-1))))","v":11},3.09,{"$f":"IF(Q40=\"n.a.\",0,IF(ISBLANK(Q40),\"\",INDEX(exe_punkte,MATCH(Q40,exe_slakline_2,1))))","v":5},7,{"$f":"IF(S40=\"n.a.\",0,IF(ISBLANK(S40),\"\",INDEX(exe_punkte,MATCH(S40,exe_turn,1))))","v":18},null,{"$f":"IF(U40=\"n.a.\",0,IF(ISBLANK(U40),\"\",INDEX(exe_punkte,MATCH(U40,exe_9sprung,1))))","v":""},46,{"$f":"IF(W40=\"n.a.\",0,IF(ISBLANK(W40),\"\",INDEX(exe_punkte,MATCH(W40,exe_10sprung,1))))","v":23},null,null,null,null,146,{"$f":"IF(AC40=\"n.a.\",0,IF(ISBLANK(AC40),\"\",INDEX(exe_punkte,MATCH(AC40,exe_ring_3,1))))","v":16},4,{"$f":"IF(AE40=\"n.a.\",0,IF(ISBLANK(AE40),\"\",INDEX(exe_punkte,MATCH(AE40,exe_klapp,-1))))","v":26},"00:23:54.300",{"$f":"IF(AG40=\"n.a.\",0,IF(ISBLANK(AG40),\"\",INDEX(exe_punkte,MATCH(((AG40-$D$5)/$D$5)*100,exe_wk,-1))*2))","v":36},{"$f":"IFERROR(IF(ROW(B40)=ROW(F40),IF(ISBLANK(B40),\"\",SUM(F40,H40,J40,L40,N40,P40,R40,T40,V40,X40,Z40,AB40,AD40,AF40,AH40)),\"Fehler! Ausschneiden nicht erlaubt\"),\"Fehler! Ausschneiden nicht erlaubt\")","v":207}]
["",null,null,null,null,{"$f":"IF(E41=\"n.a.\",0,IF(ISBLANK(E41),\"\",INDEX(exe_punkte,MATCH(E41,exe_seil_3,1))))","v":""},null,{"$f":"IF(G41=\"n.a.\",0,IF(ISBLANK(G41),\"\",INDEX(exe_punkte,MATCH(G41,exe_roll_3,1))))","v":""},null,{"$f":"IF(I41=\"n.a.\",0,IF(ISBLANK(I41),\"\",INDEX(exe_punkte,MATCH(I41,exe_klimm,1))))","v":""},null,{"$f":"IF(K41=\"n.a.\",0,IF(ISBLANK(K41),\"\",INDEX(exe_punkte,MATCH(K41,exe_30m,-1))))","v":""},null,{"$f":"IF(M41=\"n.a.\",0,IF(ISBLANK(M41),\"\",INDEX(exe_punkte,MATCH(M41,exe_hind,-1))))","v":""},null,{"$f":"IF(O41=\"n.a.\",0,IF(ISBLANK(O41),\"\",INDEX(exe_punkte,MATCH(O41,exe_kabu,-1))))","v":""},null,{"$f":"IF(Q41=\"n.a.\",0,IF(ISBLANK(Q41),\"\",INDEX(exe_punkte,MATCH(Q41,exe_slakline_2,1))))","v":""},null,{"$f":"IF(S41=\"n.a.\",0,IF(ISBLANK(S41),\"\",INDEX(exe_punkte,MATCH(S41,exe_turn,1))))","v":""},null,{"$f":"IF(U41=\"n.a.\",0,IF(ISBLANK(U41),\"\",INDEX(exe_punkte,MATCH(U41,exe_9sprung,1))))","v":""},null,{"$f":"IF(W41=\"n.a.\",0,IF(ISBLANK(W41),\"\",INDEX(exe_punkte,MATCH(W41,exe_10sprung,1))))","v":""},null,null,null,null,null,{"$f":"IF(AC41=\"n.a.\",0,IF(ISBLANK(AC41),\"\",INDEX(exe_punkte,MATCH(AC41,exe_ring_3,1))))","v":""},null,{"$f":"IF(AE41=\"n.a.\",0,IF(ISBLANK(AE41),\"\",INDEX(exe_punkte,MATCH(AE41,exe_klapp,-1))))","v":""},null,{"$f":"IF(AG41=\"n.a.\",0,IF(ISBLANK(AG41),\"\",INDEX(exe_punkte,MATCH(((AG41-$D$5)/$D$5)*100,exe_wk,-1))*2))","v":""},{"$f":"IFERROR(IF(ROW(B41)=ROW(F41),IF(ISBLANK(B41),\"\",SUM(F41,H41,J41,L41,N41,P41,R41,T41,V41,X41,Z41,AB41,AD41,AF41,AH41)),\"Fehler! Ausschneiden nicht erlaubt\"),\"Fehler! Ausschneiden nicht erlaubt\")","v":""}]
["",null,null,null,null,"",null,"",null,"",null,"",null,"",null,"",null,"",null,"",null,"",null,"",null,null,null,null,null,"",null,"",null,"",""]
["",null,null,null,null,"",null,"",null,"",null,"",null,"",null,"",null,"",null,"",null,"",null,"",null,null,null,null,null,"",null,"",null,"",""]
["",null,null,null,null,"",null,"",null,"",null,"",null,"",null,"",null,"",null,"",null,"",null,"",null,null,null,null,null,"",null,"",null,"",""]
["",null,null,null,null,"",null,"",null,"",null,"",null,"",null,"",null,"",null,"",null,"",null,"",null,null,null,null,null,"",null,"",null,"",""]
["",null,null,null,null,"",null,"",null,"",null,"",null,"",null,"",null,"",null,"",null,"",null,"",null,null,null,null,null,"",null,"",null,"",""]
["",null,null,null,null,"",null,"",null,"",null,"",null,"",null,"",null,"",null,"",null,"",null,"",null,null,null,null,null,"",null,"",null,"",""]
["",null,null,null,null,"",null,"",null,"",null,"",null,"",null,"",null,"",null,"",null,"",null,"",null,null,null,null,null,"",null,"",null,"",""]
["",null,null,null,null,"",null,"",null,"",null,"",null,"",null,"",null,"",null,"",null,"",null,"",null,null,null,null,null,"",null,"",null,"",""]
["",null,null,null,null,"",null,"",null,"",null,"",null,"",null,"",null,"",null,"",null,"",null,"",null,null,null,null,null,"",null,"",null,"",""]
["",null,null,null,null,"",null,"",null,"",null,"",null,"",null,"",null,"",null,"",null,"",null,"",null,null,null,null,null,"",null,"",null,"",""]
["",null,null,null,null,"",null,"",null,"",null,"",null,"",null,"",null,"",null,"",null,"",null,"",null,null,null,null,null,"",null,"",null,"",""]
["",null,null,null,null,"",null,"",null,"",null,"",null,"",null,"",null,"",null,"",null,"",null,"",null,null,null,null,null,"",null,"",null,"",""]
["",null,null,null,null,"",null,"",null,"",null,"",null,"",null,"",null,"",null,"",null,"",null,"",null,null,null,null,null,"",null,"",null,"",""]
["",null,null,null,null,"",null,"",null,"",null,"",null,"",null,"",null,"",null,"",null,"",null,"",null,null,null,null,null,"",null,"",null,"",""]
["",null,null,null,null,"",null,"",null,"",null,"",null,"",null,"",null,"",null,"",null,"",null,"",null,null,null,null,null,"",null,"",null,"",""]
["",null,null,null,null,"",null,"",null,"",null,"",null,"",null,"",null,"",null,"",null,"",null,"",null,null,null,null,null,"",null,"",null,"",""]
["",null,null,null,null,"",null,"",null,"",null,"",null,"",null,"",null,"",null,"",null,"",null,"",null,null,null,null,null,"",null,"",null,"",""]
[]
[]
["Übung 1",null,1,true,null,"Str.Nr. 142 BOBO, Finn erhäkt keine RS durch ein Sicherheitsvergehen"]
[]
["Übung 2",null,2,true]
[]
["Übung 3",null,3,false]
[]
["Übung 4",null,4,true]
[]
["Übung 5",null,6,true]
[]
["Übung 6",null,17,true]
[]
["Übung 7",null,10,true]
[]
["Übung 8",null,19,true]
[]
["Übung 9",null,8,false]
[]
["Übung 10",null,7,true]
[]
["Wahlübung 1",null,null,false]
[]
["Wahlübung 2",null,null,false]

{"sheet":"AK15","index":10,"n_rows":82,"n_cols":35,"rows_kept":82,"cut":false,"hidden":false,"merged":[[7,30,8,31],[7,32,8,33],[7,34,8,34],[7,18,8,19],[7,20,8,21],[7,22,8,23],[7,24,8,25],[7,26,8,27],[7,28,8,29],[6,28,6,29],[6,30,6,31],[6,32,6,33],[7,4,8,5],[7,6,8,7],[7,8,8,9],[7,10,8,11],[7,12,8,13],[7,14,8,15],[7,16,8,17],[6,16,6,17],[6,18,6,19],[6,20,6,21],[6,22,6,23],[6,24,6,25],[6,26,6,27],[6,14,6,15],[6,4,6,5],[6,6,6,7],[6,8,6,9],[6,10,6,11],[6,12,6,13]]}
["Altersklasse:",null,null,{"$f":"MID(CELL(\"Dateiname\",$A$1),FIND(\"]\",CELL(\"Dateiname\",$A$1))+1,31)","v":"AK15"}]
[]
["Siegzeit Wettkampf m:",null,null,"00:18:29.500"]
[]
["Siegzeit Wettkampf w:",null,null,"00:21:08.400"]
[]
[null,null,null,null,"Übung 1",null,"Übung 2",null,"Übung 3",null,"Übung 4",null,"Übung 5",null,"Übung 6",null,"Übung 7",null,"Übung 8",null,"Übung 9",null,"Übung 10",null,"Wahl 1",null,"Wahl 2"]
[null,null,null,null,{"$f":"IF(ISBLANK($C$60),\"\",INDEX(exercisesSelect,$C$60,1))","v":"Seilspringen"},null,{"$f":"IF(ISBLANK($C$62),\"\",INDEX(exercisesSelect,$C$62,1))","v":"Rollbrett"},null,{"$f":"IF(ISBLANK($C$64),\"\",INDEX(exercisesSelect,$C$64,1))","v":"Klimmzüge"},null,{"$f":"IF(ISBLANK($C$66),\"\",INDEX(exercisesSelect,$C$66,1))","v":"30m"},null,{"$f":"IF(ISBLANK($C$68),\"\",INDEX(exercisesSelect,$C$68,1))","v":"Hindernis lauf"},null,{"$f":"IF(ISBLANK($C$70),\"\",INDEX(exercisesSelect,$C$70,1))","v":"Kabulauf"},null,{"$f":"IF(ISBLANK($C$72),\"\",INDEX(exercisesSelect,$C$72,1))","v":"Slakline"},null,{"$f":"IF(ISBLANK($C$74),\"\",INDEX(exercisesSelect,$C$74,1))","v":"Turnen"},null,{"$f":"IF(ISBLANK($C$76),\"\",INDEX(exercisesSelect,$C$76,1))","v":"9er-Sprung"},null,{"$f":"IF(ISBLANK($C$78),\"\",INDEX(exercisesSelect,$C$78,1))","v":"10er-Sprung schritte"},null,{"$f":"IF(ISBLANK($C$80),\"\",INDEX(exercisesSelect,$C$80,1))","v":""},null,{"$f":"IF(ISBLANK($C$82),\"\",INDEX(exercisesSelect,$C$82,1))","v":""},null,"Ring\nschießen",null,"BS / Klapp",null,"Komplex - WK",null,"Punkte"]
[]
["Platz","St-Nr.","Name, Vorname","Verein",null,"Pkt",null,"Pkt",null,"Pkt",null,"Pkt",null,"Pkt",null,"Pkt",null,"Pkt",null,"Pkt",null,"Pkt",null,"Pkt",null,"Pkt",null,"Pkt",null,"Pkt",null,"Pkt",null,"Pkt"]
[{"$f":"IF(ISBLANK(B11),\"\",RANK(AI11,$AI$11:$AI$33))","v":1},128,"WÖLKERLING, Paul","PSV Schwarzenberg",511,{"$f":"IF(E11=\"n.a.\",0,IF(ISBLANK(E11),\"\",INDEX(exe_punkte,MATCH(E11,exe_seil_3,1))))","v":45},75,{"$f":"IF(G11=\"n.a.\",0,IF(ISBLANK(G11),\"\",INDEX(exe_punkte,MATCH(G11,exe_roll_3,1))))","v":40},null,{"$f":"IF(I11=\"n.a.\",0,IF(ISBLANK(I11),\"\",INDEX(exe_punkte,MATCH(I11,exe_klimm,1))))","v":""},4.41,{"$f":"IF(K11=\"n.a.\",0,IF(ISBLANK(K11),\"\",INDEX(exe_punkte,MATCH(K11,exe_30m,-1))))","v":34},30.69,{"$f":"IF(M11=\"n.a.\",0,IF(ISBLANK(M11),\"\",INDEX(exe_punkte,MATCH(M11,exe_hind,-1))))","v":40},12.5,{"$f":"IF(O11=\"n.a.\",0,IF(ISBLANK(O11),\"\",INDEX(exe_punkte,MATCH(O11,exe_kabu,-1))))","v":40},10,{"$f":"IF(Q11=\"n.a.\",0,IF(ISBLANK(Q11),\"\",INDEX(exe_punkte,MATCH(Q11,exe_slakline_2,1))))","v":50},14.5,{"$f":"IF(S11=\"n.a.\",0,IF(ISBLANK(S11),\"\",INDEX(exe_punkte,MATCH(S11,exe_turn,1))))","v":45},null,{"$f":"IF(U11=\"n.a.\",0,IF(ISBLANK(U11),\"\",INDEX(exe_punkte,MATCH(U11,exe_9sprung,1))))","v":""},89,{"$f":"IF(W11=\"n.a.\",0,IF(ISBLANK(W11),\"\",INDEX(exe_punkte,MATCH(W11,exe_10sprung,1))))","v":49},null,null,null,null,137,{"$f":"IF(AC11=\"n.a.\",0,IF(ISBLANK(AC11),\"\",INDEX(exe_punkte,MATCH(AC11,exe_ring_3,1))))","v":7},"n.A.",{"$f":"IF(AE11=\"n.a.\",0,IF(ISBLANK(AE11),\"\",INDEX(exe_punkte,MATCH(AE11,exe_klapp,-1))))","v":0},"00:18:56.300",{"$f":"IF(AG11=\"n.a.\",0,IF(ISBLANK(AG11),\"\",INDEX(exe_punkte,MATCH(((AG11-$D$3)/$D$3)*100,exe_wk,-1))*2))","v":90},{"$f":"IFERROR(IF(ROW(B11)=ROW(F11),IF(ISBLANK(B11),\"\",SUM(F11,H11,J11,L11,N11,P11,R11,T11,V11,X11,Z11,AB11,AD11,AF11,AH11)),\"Fehler! Ausschneiden nicht erlaubt\"),\"Fehler! Ausschneiden nicht erlaubt\")","v":440}]
[{"$f":"IF(ISBLANK(B12),\"\",RANK(AI12,$AI$11:$AI$33))","v":2},130,"SOCHA, Norwin","SSV Altenberg LSP",491,42,74,40,null,"",4.43,34,31.97,37,11.3,50,10,50,12.5,36,null,"",83,43,null,null,null,null,151,21,3,32,"00:20:24.900",50,435]
[3,127,"HUNGER, Lennart","SG Klotzsche LSP",426,34,70,36,null,"",4.1399999999999997,44,32.590000000000003,36,15.26,13,3.68,8,11,32,null,"",97,50,null,null,null,null,152,22,4,26,"00:18:29.500",100,401]
[4,125,"SIEGISMUND, Wilbert","SG Schellerhau LSP",498,43,76,42,null,"",4.57,32,34.25,31,13.53,29,10,50,13,40,null,"",61,30,null,null,null,null,166,36,3,32,"00:21:20.500",32,397]
[5,123,"HANISCH, Christopher","SV Grün-Weiß-Pirna e.V. LSP",467,39,74,40,null,"",4.45,34,35.380000000000003,29,15.15,14,6.89,24,10.5,28,null,"",70,35,null,null,null,null,147,17,1,44,"00:20:15.500",56,360]
[6,129,"ZIELONKA, Timo","SG Blau-Weiß Zwenkau",408,32,68,34,null,"",4.6500000000000004,30,36.409999999999997,26,14.58,19,10,50,12,36,null,"",70,35,null,null,null,null,139,9,4,26,"00:20:33",44,341]
[7,124,"LENGNING, Theo","SG Stahl Schmiedeberg LSP",490,42,58,23,null,"",4.84,26,36.28,26,13.56,29,1.69,0,13.5,40,null,"",68,34,null,null,null,null,126,0,4,26,"00:19:58.500",60,306]
[8,126,"REIM, Ole-Jonas","TSG Sehma",null,"",null,"",null,"",null,"",null,"",null,"",null,"",null,"",null,"",null,"",null,null,null,null,177,47,4,26,null,"",73]
["",null,null,null,null,{"$f":"IF(E19=\"n.a.\",0,IF(ISBLANK(E19),\"\",INDEX(exe_punkte,MATCH(E19,exe_seil_3,1))))","v":""},null,{"$f":"IF(G19=\"n.a.\",0,IF(ISBLANK(G19),\"\",INDEX(exe_punkte,MATCH(G19,exe_roll_3,1))))","v":""},null,{"$f":"IF(I19=\"n.a.\",0,IF(ISBLANK(I19),\"\",INDEX(exe_punkte,MATCH(I19,exe_klimm,1))))","v":""},null,{"$f":"IF(K19=\"n.a.\",0,IF(ISBLANK(K19),\"\",INDEX(exe_punkte,MATCH(K19,exe_30m,-1))))","v":""},null,{"$f":"IF(M19=\"n.a.\",0,IF(ISBLANK(M19),\"\",INDEX(exe_punkte,MATCH(M19,exe_hind,-1))))","v":""},null,{"$f":"IF(O19=\"n.a.\",0,IF(ISBLANK(O19),\"\",INDEX(exe_punkte,MATCH(O19,exe_kabu,-1))))","v":""},null,{"$f":"IF(Q19=\"n.a.\",0,IF(ISBLANK(Q19),\"\",INDEX(exe_punkte,MATCH(Q19,exe_slakline_2,1))))","v":""},null,{"$f":"IF(S19=\"n.a.\",0,IF(ISBLANK(S19),\"\",INDEX(exe_punkte,MATCH(S19,exe_turn,1))))","v":""},null,{"$f":"IF(U19=\"n.a.\",0,IF(ISBLANK(U19),\"\",INDEX(exe_punkte,MATCH(U19,exe_9sprung,1))))","v":""},null,{"$f":"IF(W19=\"n.a.\",0,IF(ISBLANK(W19),\"\",INDEX(exe_punkte,MATCH(W19,exe_10sprung,1))))","v":""},null,null,null,null,null,{"$f":"IF(AC19=\"n.a.\",0,IF(ISBLANK(AC19),\"\",INDEX(exe_punkte,MATCH(AC19,exe_ring_3,1))))","v":""},null,{"$f":"IF(AE19=\"n.a.\",0,IF(ISBLANK(AE19),\"\",INDEX(exe_punkte,MATCH(AE19,exe_klapp,-1))))","v":""},null,{"$f":"IF(AG19=\"n.a.\",0,IF(ISBLANK(AG19),\"\",INDEX(exe_punkte,MATCH(((AG19-$D$3)/$D$3)*100,exe_wk,-1))*2))","v":""},{"$f":"IFERROR(IF(ROW(B19)=ROW(F19),IF(ISBLANK(B19),\"\",SUM(F19,H19,J19,L19,N19,P19,R19,T19,V19,X19,Z19,AB19,AD19,AF19,AH19)),\"Fehler! Ausschneiden nicht erlaubt\"),\"Fehler! Ausschneiden nicht erlaubt\")","v":""}]
["",null,null,null,null,"",null,"",null,"",null,"",null,"",null,"",null,"",null,"",null,"",null,"",null,null,null,null,null,"",null,"",null,"",""]
["",null,null,null,null,"",null,"",null,"",null,"",null,"",null,"",null,"",null,"",null,"",null,"",null,null,null,null,null,"",null,"",null,"",""]
["",null,null,null,null,"",null,"",null,"",null,"",null,"",null,"",null,"",null,"",null,"",null,"",null,null,null,null,null,"",null,"",null,"",""]
["",null,null,null,null,"",null,"",null,"",null,"",null,"",null,"",null,"",null,"",null,"",null,"",null,null,null,null,null,"",null,"",null,"",""]
["",null,null,null,null,"",null,"",null,"",null,"",null,"",null,"",null,"",null,"",null,"",null,"",null,null,null,null,null,"",null,"",null,"",""]
["",null,null,null,null,"",null,"",null,"",null,"",null,"",null,"",null,"",null,"",null,"",null,"",null,null,null,null,null,"",null,"",null,"",""]
["",null,null,null,null,"",null,"",null,"",null,"",null,"",null,"",null,"",null,"",null,"",null,"",null,null,null,null,null,"",null,"",null,"",""]
["",null,null,null,null,"",null,"",null,"",null,"",null,"",null,"",null,"",null,"",null,"",null,"",null,null,null,null,null,"",null,"",null,"",""]
["",null,null,null,null,"",null,"",null,"",null,"",null,"",null,"",null,"",null,"",null,"",null,"",null,null,null,null,null,"",null,"",null,"",""]
["",null,null,null,null,"",null,"",null,"",null,"",null,"",null,"",null,"",null,"",null,"",null,"",null,null,null,null,null,"",null,"",null,"",""]
["",null,null,null,null,"",null,"",null,"",null,"",null,"",null,"",null,"",null,"",null,"",null,"",null,null,null,null,null,"",null,"",null,"",""]
["",null,null,null,null,"",null,"",null,"",null,"",null,"",null,"",null,"",null,"",null,"",null,"",null,null,null,null,null,"",null,"",null,"",""]
["",null,null,null,null,"",null,"",null,"",null,"",null,"",null,"",null,"",null,"",null,"",null,"",null,null,null,null,null,"",null,"",null,"",""]
[""]
["Platz","St-Nr.","Name, Vorname","Verein",null,"Pkt",null,"Pkt",null,"Pkt",null,"Pkt",null,"Pkt",null,"Pkt",null,"Pkt",null,"Pkt",null,"Pkt",null,"Pkt",null,"Pkt",null,"Pkt",null,"Pkt",null,"Pkt",null,"Pkt"]
[null,null,null,null,null,{"$f":"IF(E35=\"n.a.\",0,IF(ISBLANK(E35),\"\",INDEX(exe_punkte,MATCH(E35,exe_seil_3,1))))","v":""},null,{"$f":"IF(G35=\"n.a.\",0,IF(ISBLANK(G35),\"\",INDEX(exe_punkte,MATCH(G35,exe_roll_3,1))))","v":""},null,{"$f":"IF(I35=\"n.a.\",0,IF(ISBLANK(I35),\"\",INDEX(exe_punkte,MATCH(I35,exe_klimm,1))))","v":""},null,{"$f":"IF(K35=\"n.a.\",0,IF(ISBLANK(K35),\"\",INDEX(exe_punkte,MATCH(K35,exe_30m,-1))))","v":""},null,{"$f":"IF(M35=\"n.a.\",0,IF(ISBLANK(M35),\"\",INDEX(exe_punkte,MATCH(M35,exe_hind,-1))))","v":""},null,{"$f":"IF(O35=\"n.a.\",0,IF(ISBLANK(O35),\"\",INDEX(exe_punkte,MATCH(O35,exe_kabu,-1))))","v":""},null,{"$f":"IF(Q35=\"n.a.\",0,IF(ISBLANK(Q35),\"\",INDEX(exe_punkte,MATCH(Q35,exe_slakline_2,1))))","v":""},null,{"$f":"IF(S35=\"n.a.\",0,IF(ISBLANK(S35),\"\",INDEX(exe_punkte,MATCH(S35,exe_turn,1))))","v":""},null,{"$f":"IF(U35=\"n.a.\",0,IF(ISBLANK(U35),\"\",INDEX(exe_punkte,MATCH(U35,exe_9sprung,1))))","v":""},null,{"$f":"IF(W35=\"n.a.\",0,IF(ISBLANK(W35),\"\",INDEX(exe_punkte,MATCH(W35,exe_10sprung,1))))","v":""},null,null,null,null,null,{"$f":"IF(AC35=\"n.a.\",0,IF(ISBLANK(AC35),\"\",INDEX(exe_punkte,MATCH(AC35,exe_ring_3,1))))","v":""},null,{"$f":"IF(AE35=\"n.a.\",0,IF(ISBLANK(AE35),\"\",INDEX(exe_punkte,MATCH(AE35,exe_klapp,-1))))","v":""},null,{"$f":"IF(AG35=\"n.a.\",0,IF(ISBLANK(AG35),\"\",INDEX(exe_punkte,MATCH(((AG35-$D$5)/$D$5)*100,exe_wk,-1))*2))","v":""},{"$f":"IFERROR(IF(ROW(B35)=ROW(F35),IF(ISBLANK(B35),\"\",SUM(F35,H35,J35,L35,N35,P35,R35,T35,V35,X35,Z35,AB35,AD35,AF35,AH35)),\"Fehler! Ausschneiden nicht erlaubt\"),\"Fehler! Ausschneiden nicht erlaubt\")","v":""}]
[{"$f":"IF(ISBLANK(B36),\"\",RANK(AI36,$AI$36:$AI$58))","v":1},151,"GÖHLER, Kyra","TSG Sehma",487,{"$f":"IF(E36=\"n.a.\",0,IF(ISBLANK(E36),\"\",INDEX(exe_punkte,MATCH(E36,exe_seil_3,1))))","v":41},71,{"$f":"IF(G36=\"n.a.\",0,IF(ISBLANK(G36),\"\",INDEX(exe_punkte,MATCH(G36,exe_roll_3,1))))","v":36},null,{"$f":"IF(I36=\"n.a.\",0,IF(ISBLANK(I36),\"\",INDEX(exe_punkte,MATCH(I36,exe_klimm,1))))","v":""},4.74,{"$f":"IF(K36=\"n.a.\",0,IF(ISBLANK(K36),\"\",INDEX(exe_punkte,MATCH(K36,exe_30m,-1))))","v":28},33.69,{"$f":"IF(M36=\"n.a.\",0,IF(ISBLANK(M36),\"\",INDEX(exe_punkte,MATCH(M36,exe_hind,-1))))","v":33},13.08,{"$f":"IF(O36=\"n.a.\",0,IF(ISBLANK(O36),\"\",INDEX(exe_punkte,MATCH(O36,exe_kabu,-1))))","v":34},10,{"$f":"IF(Q36=\"n.a.\",0,IF(ISBLANK(Q36),\"\",INDEX(exe_punkte,MATCH(Q36,exe_slakline_2,1))))","v":50},13.5,{"$f":"IF(S36=\"n.a.\",0,IF(ISBLANK(S36),\"\",INDEX(exe_punkte,MATCH(S36,exe_turn,1))))","v":40},null,{"$f":"IF(U36=\"n.a.\",0,IF(ISBLANK(U36),\"\",INDEX(exe_punkte,MATCH(U36,exe_9sprung,1))))","v":""},69,{"$f":"IF(W36=\"n.a.\",0,IF(ISBLANK(W36),\"\",INDEX(exe_punkte,MATCH(W36,exe_10sprung,1))))","v":34},null,null,null,null,164,{"$f":"IF(AC36=\"n.a.\",0,IF(ISBLANK(AC36),\"\",INDEX(exe_punkte,MATCH(AC36,exe_ring_3,1))))","v":34},4,{"$f":"IF(AE36=\"n.a.\",0,IF(ISBLANK(AE36),\"\",INDEX(exe_punkte,MATCH(AE36,exe_klapp,-1))))","v":26},"00:21:45.900",{"$f":"IF(AG36=\"n.a.\",0,IF(ISBLANK(AG36),\"\",INDEX(exe_punkte,MATCH(((AG36-$D$5)/$D$5)*100,exe_wk,-1))*2))","v":90},{"$f":"IFERROR(IF(ROW(B36)=ROW(F36),IF(ISBLANK(B36),\"\",SUM(F36,H36,J36,L36,N36,P36,R36,T36,V36,X36,Z36,AB36,AD36,AF36,AH36)),\"Fehler! Ausschneiden nicht erlaubt\"),\"Fehler! Ausschneiden nicht erlaubt\")","v":446}]
[{"$f":"IF(ISBLANK(B37),\"\",RANK(AI37,$AI$36:$AI$58))","v":2},148,"KÖHLER, Yara","TSG Sehma",444,36,72,38,null,"",4.78,28,32.94,35,12.86,36,9.31,43,13,40,null,"",62,31,null,null,null,null,141,11,3,32,"00:21:17.200",98,428]
[3,149,"SCHIPPERS, Hannah","SV Grün-Weiß-Pirna e.V.",489,42,70,36,null,"",4.66,30,33.72,33,13.09,34,10,50,13,40,null,"",75,37,null,null,null,null,144,14,5,20,"00:22:31.800",70,406]
[4,122,"KÜHNE, Karoline","SV Grün-Weiß-Pirna e.V.",392,30,45,11,null,"",4.8899999999999997,26,37.619999999999997,23,14.51,19,7.09,25,13,40,null,"",54,27,null,null,null,null,148,18,1,44,"00:21:08.400",100,363]
[5,150,"HEINZ, Fabienne","TSG Sehma",468,39,51,17,null,"",4.93,24,33.53,33,13.56,29,10,50,11.5,32,null,"",53,26,null,null,null,null,155,25,4,26,"00:23:42",38,339]
[6,152,"CASPAR, Leoni","SV Grün-Weiß-Pirna e.V.",448,36,56,20,null,"",5.01,22,35.340000000000003,29,14.15,23,10,50,11,32,null,"",52,26,null,null,null,null,161,31,4,26,"00:24:33.100",30,325]
[7,147,"RIEDEL, Pia","OBV Ringenhain",447,36,70,36,null,"",4.91,24,37.25,24,13.38,31,10,50,9.5,24,null,"",56,28,null,null,null,null,141,11,6,14,"00:24:48.200",28,306]
[8,153,"SCHROSCHK, Isalie","SG Blau-Weiß Zwenkau",444,36,45,11,null,"",4.92,24,34.43,31,13.94,25,10,50,6,15,null,"",61,30,null,null,null,null,150,20,6,14,null,"",256]
[9,154,"WURSTER, Marit Magdalena","SG Klotzsche",423,33,30,1,null,"",4.59,32,37.869999999999997,22,14.87,16,2.0499999999999998,0,8.5,21,null,"",61,30,null,null,null,null,151,21,3,32,"00:25:11.600",24,232]
[10,155,"SÜHNEL, Emma","SG Blau-Weiß Zwenkau",440,35,45,11,null,"",5.15,20,39.47,18,15.24,13,2.62,3,10.5,28,null,"",28,14,null,null,null,null,133,3,4,26,"00:24:07.400",34,205]
[11,156,"KLOß, Mia","SV Grün-Weiß-Pirna e.V.",451,37,38,5,null,"",5.15,20,38.97,20,14.33,21,1.35,0,12,36,null,"",35,17,null,null,null,null,147,17,7,8,null,"",181]
["",null,null,null,null,{"$f":"IF(E47=\"n.a.\",0,IF(ISBLANK(E47),\"\",INDEX(exe_punkte,MATCH(E47,exe_seil_3,1))))","v":""},null,{"$f":"IF(G47=\"n.a.\",0,IF(ISBLANK(G47),\"\",INDEX(exe_punkte,MATCH(G47,exe_roll_3,1))))","v":""},null,{"$f":"IF(I47=\"n.a.\",0,IF(ISBLANK(I47),\"\",INDEX(exe_punkte,MATCH(I47,exe_klimm,1))))","v":""},null,{"$f":"IF(K47=\"n.a.\",0,IF(ISBLANK(K47),\"\",INDEX(exe_punkte,MATCH(K47,exe_30m,-1))))","v":""},null,{"$f":"IF(M47=\"n.a.\",0,IF(ISBLANK(M47),\"\",INDEX(exe_punkte,MATCH(M47,exe_hind,-1))))","v":""},null,{"$f":"IF(O47=\"n.a.\",0,IF(ISBLANK(O47),\"\",INDEX(exe_punkte,MATCH(O47,exe_kabu,-1))))","v":""},null,{"$f":"IF(Q47=\"n.a.\",0,IF(ISBLANK(Q47),\"\",INDEX(exe_punkte,MATCH(Q47,exe_slakline_2,1))))","v":""},null,{"$f":"IF(S47=\"n.a.\",0,IF(ISBLANK(S47),\"\",INDEX(exe_punkte,MATCH(S47,exe_turn,1))))","v":""},null,{"$f":"IF(U47=\"n.a.\",0,IF(ISBLANK(U47),\"\",INDEX(exe_punkte,MATCH(U47,exe_9sprung,1))))","v":""},null,{"$f":"IF(W47=\"n.a.\",0,IF(ISBLANK(W47),\"\",INDEX(exe_punkte,MATCH(W47,exe_10sprung,1))))","v":""},null,null,null,null,null,{"$f":"IF(AC47=\"n.a.\",0,IF(ISBLANK(AC47),\"\",INDEX(exe_punkte,MATCH(AC47,exe_ring_3,1))))","v":""},null,{"$f":"IF(AE47=\"n.a.\",0,IF(ISBLANK(AE47),\"\",INDEX(exe_punkte,MATCH(AE47,exe_klapp,-1))))","v":""},null,{"$f":"IF(AG47=\"n.a.\",0,IF(ISBLANK(AG47),\"\",INDEX(exe_punkte,MATCH(((AG47-$D$5)/$D$5)*100,exe_wk,-1))*2))","v":""},{"$f":"IFERROR(IF(ROW(B47)=ROW(F47),IF(ISBLANK(B47),\"\",SUM(F47,H47,J47,L47,N47,P47,R47,T47,V47,X47,Z47,AB47,AD47,AF47,AH47)),\"Fehler! Ausschneiden nicht erlaubt\"),\"Fehler! Ausschneiden nicht erlaubt\")","v":""}]
["",null,null,null,null,"",null,"",null,"",null,"",null,"",null,"",null,"",null,"",null,"",null,"",null,null,null,null,null,"",null,"",null,"",""]
["",null,null,null,null,"",null,"",null,"",null,"",null,"",null,"",null,"",null,"",null,"",null,"",null,null,null,null,null,"",null,"",null,"",""]
["",null,null,null,null,"",null,"",null,"",null,"",null,"",null,"",null,"",null,"",null,"",null,"",null,null,null,null,null,"",null,"",null,"",""]
["",null,null,null,null,"",null,"",null,"",null,"",null,"",null,"",null,"",null,"",null,"",null,"",null,null,null,null,null,"",null,"",null,"",""]
["",null,null,null,null,"",null,"",null,"",null,"",null,"",null,"",null,"",null,"",null,"",null,"",null,null,null,null,null,"",null,"",null,"",""]
["",null,null,null,null,"",null,"",null,"",null,"",null,"",null,"",null,"",null,"",null,"",null,"",null,null,null,null,null,"",null,"",null,"",""]
["",null,null,null,null,"",null,"",null,"",null,"",null,"",null,"",null,"",null,"",null,"",null,"",null,null,null,null,null,"",null,"",null,"",""]
["",null,null,null,null,"",null,"",null,"",null,"",null,"",null,"",null,"",null,"",null,"",null,"",null,null,null,null,null,"",null,"",null,"",""]
["",null,null,null,null,"",null,"",null,"",null,"",null,"",null,"",null,"",null,"",null,"",null,"",null,null,null,null,null,"",null,"",null,"",""]
["",null,null,null,null,"",null,"",null,"",null,"",null,"",null,"",null,"",null,"",null,"",null,"",null,null,null,null,null,"",null,"",null,"",""]
[""]
[]
["Übung 1",null,1,true,null,"Str.Nr. 128 WÖLKERLING, Paul erhäkt keine BS durch ein Sicherheitsvergehen"]
[null,null,1]
["Übung 2",null,2,true]
[null,null,2]
["Übung 3",null,3,false]
[null,null,3]
["Übung 4",null,4,true]
[null,null,4]
["Übung 5",null,6,true]
[null,null,6]
["Übung 6",null,17,true]
[null,null,17]
["Übung 7",null,10,true]
[null,null,10]
["Übung 8",null,19,true]
[null,null,19]
["Übung 9",null,8,false]
[null,null,8]
["Übung 10",null,7,true]
[null,null,7]
["Wahlübung 1",null,null,false]
[]
["Wahlübung 2",null,null,false]

{"sheet":"Vorlage","index":11,"n_rows":83,"n_cols":35,"rows_kept":83,"cut":false,"hidden":true,"merged":[[6,14,6,15],[6,4,6,5],[6,6,6,7],[6,8,6,9],[6,10,6,11],[6,12,6,13],[6,28,6,29],[6,30,6,31],[6,32,6,33],[7,4,8,5],[7,6,8,7],[7,8,8,9],[7,10,8,11],[7,12,8,13],[7,14,8,15],[7,16,8,17],[6,16,6,17],[6,18,6,19],[6,20,6,21],[6,22,6,23],[6,24,6,25],[6,26,6,27],[7,30,8,31],[7,32,8,33],[7,34,8,34],[7,18,8,19],[7,20,8,21],[7,22,8,23],[7,24,8,25],[7,26,8,27],[7,28,8,29]]}
["Altersklasse:",null,null,{"$f":"MID(CELL(\"Dateiname\",$A$1),FIND(\"]\",CELL(\"Dateiname\",$A$1))+1,31)","v":"Vorlage"}]
[]
["Siegzeit Wettkampf m:"]
[]
["Siegzeit Wettkampf w:"]
[]
[null,null,null,null,"Übung 1",null,"Übung 2",null,"Übung 3",null,"Übung 4",null,"Übung 5",null,"Übung 6",null,"Übung 7",null,"Übung 8",null,"Übung 9",null,"Übung 10",null,"Wahl 1",null,"Wahl 2"]
[null,null,null,null,{"$f":"IF(ISBLANK($C$61),\"\",INDEX(exercisesSelect,$C$61,1))","v":""},null,{"$f":"IF(ISBLANK($C$63),\"\",INDEX(exercisesSelect,$C$63,1))","v":""},null,{"$f":"IF(ISBLANK($C$65),\"\",INDEX(exercisesSelect,$C$65,1))","v":""},null,{"$f":"IF(ISBLANK($C$67),\"\",INDEX(exercisesSelect,$C$67,1))","v":""},null,{"$f":"IF(ISBLANK($C$69),\"\",INDEX(exercisesSelect,$C$69,1))","v":""},null,{"$f":"IF(ISBLANK($C$71),\"\",INDEX(exercisesSelect,$C$71,1))","v":""},null,{"$f":"IF(ISBLANK($C$73),\"\",INDEX(exercisesSelect,$C$73,1))","v":""},null,{"$f":"IF(ISBLANK($C$75),\"\",INDEX(exercisesSelect,$C$75,1))","v":""},null,{"$f":"IF(ISBLANK($C$77),\"\",INDEX(exercisesSelect,$C$77,1))","v":""},null,{"$f":"IF(ISBLANK($C$79),\"\",INDEX(exercisesSelect,$C$79,1))","v":""},null,{"$f":"IF(ISBLANK($C$81),\"\",INDEX(exercisesSelect,$C$81,1))","v":""},null,{"$f":"IF(ISBLANK($C$83),\"\",INDEX(exercisesSelect,$C$83,1))","v":""},null,"Ring\nschießen",null,"BS / Klapp",null,"Komplex - WK",null,"Punkte"]
[]
["Platz","St-Nr.","Name, Vorname","Verein",null,"Pkt",null,"Pkt",null,"Pkt",null,"Pkt",null,"Pkt",null,"Pkt",null,"Pkt",null,"Pkt",null,"Pkt",null,"Pkt",null,"Pkt",null,"Pkt",null,"Pkt",null,"Pkt",null,"Pkt"]
[{"$f":"IF(ISBLANK(B11),\"\",RANK(AI11,$AI$11:$AI$33))","v":""}]
[""]
[""]
[""]
[""]
[""]
[""]
[""]
[""]
[""]
[""]
[""]
[""]
[""]
[""]
[""]
[""]
[""]
[""]
[""]
[""]
[""]
[""]
[]
["Platz","St-Nr.","Name, Vorname","Verein",null,"Pkt",null,"Pkt",null,"Pkt",null,"Pkt",null,"Pkt",null,"Pkt",null,"Pkt",null,"Pkt",null,"Pkt",null,"Pkt",null,"Pkt",null,"Pkt",null,"Pkt",null,"Pkt",null,"Pkt"]
[{"$f":"IF(ISBLANK(B36),\"\",RANK(AI36,$AI$36:$AI$58))","v":""}]
[{"$f":"IF(ISBLANK(B37),\"\",RANK(AI37,$AI$36:$AI$58))","v":""}]
[""]
[""]
[""]
[""]
[""]
[""]
[""]
[""]
[""]
[""]
[""]
[""]
[""]
[""]
[""]
[""]
[""]
[""]
[""]
[""]
[""]
[]
[]
["Übung 1",null,null,true]
[]
["Übung 2",null,null,true]
[]
["Übung 3",null,null,true]
[]
["Übung 4",null,null,true]
[]
["Übung 5",null,null,true]
[]
["Übung 6",null,null,true]
[]
["Übung 7",null,null,true]
[]
["Übung 8",null,null,true]
[]
["Übung 9",null,null,true]
[]
["Übung 10",null,null,true]
[]
["Wahlübung 1",null,null,true]
[]
["Wahlübung 2",null,null,true]